Console Output

Skipping 14,896 KB.. Full Log
[INFO] Skipping Kafka 0.10+ Token Provider for Streaming
[INFO] This project has been banned from the build due to previous failures.
[INFO] ------------------------------------------------------------------------
[INFO] 
[INFO] ------------------------------------------------------------------------
[INFO] Skipping Spark Integration for Kafka 0.10
[INFO] This project has been banned from the build due to previous failures.
[INFO] ------------------------------------------------------------------------
[INFO] 
[INFO] ------------------------------------------------------------------------
[INFO] Skipping Kafka 0.10+ Source for Structured Streaming
[INFO] This project has been banned from the build due to previous failures.
[INFO] ------------------------------------------------------------------------
[INFO] 
[INFO] ------------------------------------------------------------------------
[INFO] Skipping Spark Kinesis Integration
[INFO] This project has been banned from the build due to previous failures.
[INFO] ------------------------------------------------------------------------
[INFO] 
[INFO] ------------------------------------------------------------------------
[INFO] Skipping Spark Project Examples
[INFO] This project has been banned from the build due to previous failures.
[INFO] ------------------------------------------------------------------------
[INFO] 
[INFO] ------------------------------------------------------------------------
[INFO] Skipping Spark Integration for Kafka 0.10 Assembly
[INFO] This project has been banned from the build due to previous failures.
[INFO] ------------------------------------------------------------------------
[INFO] 
[INFO] ------------------------------------------------------------------------
[INFO] Skipping Spark Avro
[INFO] This project has been banned from the build due to previous failures.
[INFO] ------------------------------------------------------------------------
[INFO] 
[INFO] ------------------------------------------------------------------------
[INFO] Skipping Spark Project Kinesis Assembly
[INFO] This project has been banned from the build due to previous failures.
[INFO] ------------------------------------------------------------------------
[INFO] ------------------------------------------------------------------------
[INFO] Reactor Summary for Spark Project Parent POM 3.3.0-SNAPSHOT:
[INFO] 
[INFO] Spark Project Parent POM ........................... SUCCESS [  3.627 s]
[INFO] Spark Project Tags ................................. SUCCESS [  4.093 s]
[INFO] Spark Project Sketch ............................... SUCCESS [ 10.350 s]
[INFO] Spark Project Local DB ............................. SUCCESS [  4.029 s]
[INFO] Spark Project Networking ........................... SUCCESS [ 51.355 s]
[INFO] Spark Project Shuffle Streaming Service ............ SUCCESS [ 10.272 s]
[INFO] Spark Project Unsafe ............................... SUCCESS [  2.977 s]
[INFO] Spark Project Launcher ............................. SUCCESS [  3.443 s]
[INFO] Spark Project Core ................................. FAILURE [34:23 min]
[INFO] Spark Project ML Local Library ..................... SKIPPED
[INFO] Spark Project GraphX ............................... SKIPPED
[INFO] Spark Project Streaming ............................ SKIPPED
[INFO] Spark Project Catalyst ............................. SKIPPED
[INFO] Spark Project SQL .................................. SKIPPED
[INFO] Spark Project ML Library ........................... SKIPPED
[INFO] Spark Project Tools ................................ SUCCESS [  1.364 s]
[INFO] Spark Project Hive ................................. SKIPPED
[INFO] Spark Project REPL ................................. SKIPPED
[INFO] Spark Project YARN Shuffle Service ................. SUCCESS [  1.997 s]
[INFO] Spark Project YARN ................................. SKIPPED
[INFO] Spark Project Mesos ................................ SKIPPED
[INFO] Spark Project Hive Thrift Server ................... SKIPPED
[INFO] Spark Project Assembly ............................. SKIPPED
[INFO] Kafka 0.10+ Token Provider for Streaming ........... SKIPPED
[INFO] Spark Integration for Kafka 0.10 ................... SKIPPED
[INFO] Kafka 0.10+ Source for Structured Streaming ........ SKIPPED
[INFO] Spark Kinesis Integration .......................... SKIPPED
[INFO] Spark Project Examples ............................. SKIPPED
[INFO] Spark Integration for Kafka 0.10 Assembly .......... SKIPPED
[INFO] Spark Avro ......................................... SKIPPED
[INFO] Spark Project Kinesis Assembly ..................... SKIPPED
[INFO] ------------------------------------------------------------------------
[INFO] BUILD FAILURE
[INFO] ------------------------------------------------------------------------
[INFO] Total time:  35:57 min
[INFO] Finished at: 2021-12-03T10:40:24-08:00
[INFO] ------------------------------------------------------------------------
[WARNING] The requested profile "hive-2.3" could not be activated because it does not exist.
[ERROR] Failed to execute goal org.scalatest:scalatest-maven-plugin:2.0.2:test (test) on project spark-core_2.13: There are test failures -> [Help 1]
[ERROR] 
[ERROR] To see the full stack trace of the errors, re-run Maven with the -e switch.
[ERROR] Re-run Maven using the -X switch to enable full debug logging.
[ERROR] 
[ERROR] For more information about the errors and possible solutions, please read the following articles:
[ERROR] [Help 1] http://cwiki.apache.org/confluence/display/MAVEN/MojoFailureException
[ERROR] 
[ERROR] After correcting the problems, you can resume the build with the command
[ERROR]   mvn <args> -rf :spark-core_2.13
+ retcode2=1
+ [[ 0 -ne 0 ]]
+ [[ 1 -ne 0 ]]
+ [[ 0 -ne 0 ]]
+ [[ 1 -ne 0 ]]
+ echo 'Testing Spark with Maven failed'
Testing Spark with Maven failed
+ exit 1
Build step 'Execute shell' marked build as failure
Archiving artifacts
Recording test results
[Checks API] No suitable checks publisher found.
Finished: FAILURE