Console Output

Skipping 1,445 KB.. Full Log
spark-3.3.0-SNAPSHOT-bin-20210915-bbb33af2e4/examples/src/main/java/org/apache/spark/examples/ml/JavaChiSquareTestExample.java
spark-3.3.0-SNAPSHOT-bin-20210915-bbb33af2e4/examples/src/main/java/org/apache/spark/examples/ml/JavaDecisionTreeRegressionExample.java
spark-3.3.0-SNAPSHOT-bin-20210915-bbb33af2e4/examples/src/main/java/org/apache/spark/examples/ml/JavaTokenizerExample.java
spark-3.3.0-SNAPSHOT-bin-20210915-bbb33af2e4/examples/src/main/java/org/apache/spark/examples/ml/JavaUnivariateFeatureSelectorExample.java
spark-3.3.0-SNAPSHOT-bin-20210915-bbb33af2e4/examples/src/main/java/org/apache/spark/examples/ml/JavaLogisticRegressionWithElasticNetExample.java
spark-3.3.0-SNAPSHOT-bin-20210915-bbb33af2e4/examples/src/main/java/org/apache/spark/examples/ml/JavaInteractionExample.java
spark-3.3.0-SNAPSHOT-bin-20210915-bbb33af2e4/examples/src/main/java/org/apache/spark/examples/ml/JavaBisectingKMeansExample.java
spark-3.3.0-SNAPSHOT-bin-20210915-bbb33af2e4/examples/src/main/java/org/apache/spark/examples/ml/JavaChiSqSelectorExample.java
spark-3.3.0-SNAPSHOT-bin-20210915-bbb33af2e4/examples/src/main/java/org/apache/spark/examples/ml/JavaElementwiseProductExample.java
spark-3.3.0-SNAPSHOT-bin-20210915-bbb33af2e4/examples/src/main/java/org/apache/spark/examples/ml/JavaPrefixSpanExample.java
spark-3.3.0-SNAPSHOT-bin-20210915-bbb33af2e4/examples/src/main/java/org/apache/spark/examples/ml/JavaGradientBoostedTreeClassifierExample.java
spark-3.3.0-SNAPSHOT-bin-20210915-bbb33af2e4/examples/src/main/java/org/apache/spark/examples/ml/JavaStringIndexerExample.java
spark-3.3.0-SNAPSHOT-bin-20210915-bbb33af2e4/examples/src/main/java/org/apache/spark/examples/ml/JavaEstimatorTransformerParamExample.java
spark-3.3.0-SNAPSHOT-bin-20210915-bbb33af2e4/examples/src/main/java/org/apache/spark/examples/ml/JavaRandomForestRegressorExample.java
spark-3.3.0-SNAPSHOT-bin-20210915-bbb33af2e4/examples/src/main/java/org/apache/spark/examples/ml/JavaIndexToStringExample.java
spark-3.3.0-SNAPSHOT-bin-20210915-bbb33af2e4/examples/src/main/java/org/apache/spark/examples/ml/JavaBucketizerExample.java
spark-3.3.0-SNAPSHOT-bin-20210915-bbb33af2e4/examples/src/main/java/org/apache/spark/examples/ml/JavaALSExample.java
spark-3.3.0-SNAPSHOT-bin-20210915-bbb33af2e4/examples/src/main/java/org/apache/spark/examples/ml/JavaVectorSizeHintExample.java
spark-3.3.0-SNAPSHOT-bin-20210915-bbb33af2e4/examples/src/main/java/org/apache/spark/examples/ml/JavaGaussianMixtureExample.java
spark-3.3.0-SNAPSHOT-bin-20210915-bbb33af2e4/examples/src/main/java/org/apache/spark/examples/ml/JavaDocument.java
spark-3.3.0-SNAPSHOT-bin-20210915-bbb33af2e4/examples/src/main/java/org/apache/spark/examples/JavaWordCount.java
spark-3.3.0-SNAPSHOT-bin-20210915-bbb33af2e4/examples/src/main/java/org/apache/spark/examples/JavaPageRank.java
spark-3.3.0-SNAPSHOT-bin-20210915-bbb33af2e4/examples/src/main/java/org/apache/spark/examples/JavaTC.java
spark-3.3.0-SNAPSHOT-bin-20210915-bbb33af2e4/examples/src/main/java/org/apache/spark/examples/JavaStatusTrackerDemo.java
spark-3.3.0-SNAPSHOT-bin-20210915-bbb33af2e4/examples/src/main/java/org/apache/spark/examples/sql/
spark-3.3.0-SNAPSHOT-bin-20210915-bbb33af2e4/examples/src/main/java/org/apache/spark/examples/sql/JavaSparkSQLExample.java
spark-3.3.0-SNAPSHOT-bin-20210915-bbb33af2e4/examples/src/main/java/org/apache/spark/examples/sql/JavaSQLDataSourceExample.java
spark-3.3.0-SNAPSHOT-bin-20210915-bbb33af2e4/examples/src/main/java/org/apache/spark/examples/sql/JavaUserDefinedTypedAggregation.java
spark-3.3.0-SNAPSHOT-bin-20210915-bbb33af2e4/examples/src/main/java/org/apache/spark/examples/sql/JavaUserDefinedUntypedAggregation.java
spark-3.3.0-SNAPSHOT-bin-20210915-bbb33af2e4/examples/src/main/java/org/apache/spark/examples/sql/JavaUserDefinedScalar.java
spark-3.3.0-SNAPSHOT-bin-20210915-bbb33af2e4/examples/src/main/java/org/apache/spark/examples/sql/hive/
spark-3.3.0-SNAPSHOT-bin-20210915-bbb33af2e4/examples/src/main/java/org/apache/spark/examples/sql/hive/JavaSparkHiveExample.java
spark-3.3.0-SNAPSHOT-bin-20210915-bbb33af2e4/examples/src/main/java/org/apache/spark/examples/sql/streaming/
spark-3.3.0-SNAPSHOT-bin-20210915-bbb33af2e4/examples/src/main/java/org/apache/spark/examples/sql/streaming/JavaStructuredComplexSessionization.java
spark-3.3.0-SNAPSHOT-bin-20210915-bbb33af2e4/examples/src/main/java/org/apache/spark/examples/sql/streaming/JavaStructuredKafkaWordCount.java
spark-3.3.0-SNAPSHOT-bin-20210915-bbb33af2e4/examples/src/main/java/org/apache/spark/examples/sql/streaming/JavaStructuredKerberizedKafkaWordCount.java
spark-3.3.0-SNAPSHOT-bin-20210915-bbb33af2e4/examples/src/main/java/org/apache/spark/examples/sql/streaming/JavaStructuredNetworkWordCount.java
spark-3.3.0-SNAPSHOT-bin-20210915-bbb33af2e4/examples/src/main/java/org/apache/spark/examples/sql/streaming/JavaStructuredNetworkWordCountWindowed.java
spark-3.3.0-SNAPSHOT-bin-20210915-bbb33af2e4/examples/src/main/java/org/apache/spark/examples/sql/streaming/JavaStructuredSessionization.java
spark-3.3.0-SNAPSHOT-bin-20210915-bbb33af2e4/examples/src/main/resources/
spark-3.3.0-SNAPSHOT-bin-20210915-bbb33af2e4/examples/src/main/resources/kv1.txt
spark-3.3.0-SNAPSHOT-bin-20210915-bbb33af2e4/examples/src/main/resources/people.txt
spark-3.3.0-SNAPSHOT-bin-20210915-bbb33af2e4/examples/src/main/resources/people.csv
spark-3.3.0-SNAPSHOT-bin-20210915-bbb33af2e4/examples/src/main/resources/META-INF/
spark-3.3.0-SNAPSHOT-bin-20210915-bbb33af2e4/examples/src/main/resources/META-INF/services/
spark-3.3.0-SNAPSHOT-bin-20210915-bbb33af2e4/examples/src/main/resources/META-INF/services/org.apache.spark.sql.jdbc.JdbcConnectionProvider
spark-3.3.0-SNAPSHOT-bin-20210915-bbb33af2e4/examples/src/main/resources/META-INF/services/org.apache.spark.sql.SparkSessionExtensionsProvider
spark-3.3.0-SNAPSHOT-bin-20210915-bbb33af2e4/examples/src/main/resources/full_user.avsc
spark-3.3.0-SNAPSHOT-bin-20210915-bbb33af2e4/examples/src/main/resources/users.parquet
spark-3.3.0-SNAPSHOT-bin-20210915-bbb33af2e4/examples/src/main/resources/users.orc
spark-3.3.0-SNAPSHOT-bin-20210915-bbb33af2e4/examples/src/main/resources/employees.json
spark-3.3.0-SNAPSHOT-bin-20210915-bbb33af2e4/examples/src/main/resources/dir1/
spark-3.3.0-SNAPSHOT-bin-20210915-bbb33af2e4/examples/src/main/resources/dir1/dir2/
spark-3.3.0-SNAPSHOT-bin-20210915-bbb33af2e4/examples/src/main/resources/dir1/dir2/file2.parquet
spark-3.3.0-SNAPSHOT-bin-20210915-bbb33af2e4/examples/src/main/resources/dir1/file3.json
spark-3.3.0-SNAPSHOT-bin-20210915-bbb33af2e4/examples/src/main/resources/dir1/file1.parquet
spark-3.3.0-SNAPSHOT-bin-20210915-bbb33af2e4/examples/src/main/resources/users.avro
spark-3.3.0-SNAPSHOT-bin-20210915-bbb33af2e4/examples/src/main/resources/user.avsc
spark-3.3.0-SNAPSHOT-bin-20210915-bbb33af2e4/examples/src/main/resources/people.json
spark-3.3.0-SNAPSHOT-bin-20210915-bbb33af2e4/examples/src/main/r/
spark-3.3.0-SNAPSHOT-bin-20210915-bbb33af2e4/examples/src/main/r/RSparkSQLExample.R
spark-3.3.0-SNAPSHOT-bin-20210915-bbb33af2e4/examples/src/main/r/dataframe.R
spark-3.3.0-SNAPSHOT-bin-20210915-bbb33af2e4/examples/src/main/r/streaming/
spark-3.3.0-SNAPSHOT-bin-20210915-bbb33af2e4/examples/src/main/r/streaming/structured_network_wordcount.R
spark-3.3.0-SNAPSHOT-bin-20210915-bbb33af2e4/examples/src/main/r/ml/
spark-3.3.0-SNAPSHOT-bin-20210915-bbb33af2e4/examples/src/main/r/ml/gbt.R
spark-3.3.0-SNAPSHOT-bin-20210915-bbb33af2e4/examples/src/main/r/ml/kstest.R
spark-3.3.0-SNAPSHOT-bin-20210915-bbb33af2e4/examples/src/main/r/ml/glm.R
spark-3.3.0-SNAPSHOT-bin-20210915-bbb33af2e4/examples/src/main/r/ml/als.R
spark-3.3.0-SNAPSHOT-bin-20210915-bbb33af2e4/examples/src/main/r/ml/naiveBayes.R
spark-3.3.0-SNAPSHOT-bin-20210915-bbb33af2e4/examples/src/main/r/ml/kmeans.R
spark-3.3.0-SNAPSHOT-bin-20210915-bbb33af2e4/examples/src/main/r/ml/powerIterationClustering.R
spark-3.3.0-SNAPSHOT-bin-20210915-bbb33af2e4/examples/src/main/r/ml/decisionTree.R
spark-3.3.0-SNAPSHOT-bin-20210915-bbb33af2e4/examples/src/main/r/ml/prefixSpan.R
spark-3.3.0-SNAPSHOT-bin-20210915-bbb33af2e4/examples/src/main/r/ml/fmClassifier.R
spark-3.3.0-SNAPSHOT-bin-20210915-bbb33af2e4/examples/src/main/r/ml/bisectingKmeans.R
spark-3.3.0-SNAPSHOT-bin-20210915-bbb33af2e4/examples/src/main/r/ml/mlp.R
spark-3.3.0-SNAPSHOT-bin-20210915-bbb33af2e4/examples/src/main/r/ml/survreg.R
spark-3.3.0-SNAPSHOT-bin-20210915-bbb33af2e4/examples/src/main/r/ml/randomForest.R
spark-3.3.0-SNAPSHOT-bin-20210915-bbb33af2e4/examples/src/main/r/ml/fpm.R
spark-3.3.0-SNAPSHOT-bin-20210915-bbb33af2e4/examples/src/main/r/ml/gaussianMixture.R
spark-3.3.0-SNAPSHOT-bin-20210915-bbb33af2e4/examples/src/main/r/ml/ml.R
spark-3.3.0-SNAPSHOT-bin-20210915-bbb33af2e4/examples/src/main/r/ml/fmRegressor.R
spark-3.3.0-SNAPSHOT-bin-20210915-bbb33af2e4/examples/src/main/r/ml/logit.R
spark-3.3.0-SNAPSHOT-bin-20210915-bbb33af2e4/examples/src/main/r/ml/isoreg.R
spark-3.3.0-SNAPSHOT-bin-20210915-bbb33af2e4/examples/src/main/r/ml/svmLinear.R
spark-3.3.0-SNAPSHOT-bin-20210915-bbb33af2e4/examples/src/main/r/ml/lm_with_elastic_net.R
spark-3.3.0-SNAPSHOT-bin-20210915-bbb33af2e4/examples/src/main/r/ml/lda.R
spark-3.3.0-SNAPSHOT-bin-20210915-bbb33af2e4/examples/src/main/r/data-manipulation.R
spark-3.3.0-SNAPSHOT-bin-20210915-bbb33af2e4/examples/src/main/scripts/
spark-3.3.0-SNAPSHOT-bin-20210915-bbb33af2e4/examples/src/main/scripts/getGpusResources.sh
spark-3.3.0-SNAPSHOT-bin-20210915-bbb33af2e4/examples/src/main/scala/
spark-3.3.0-SNAPSHOT-bin-20210915-bbb33af2e4/examples/src/main/scala/org/
spark-3.3.0-SNAPSHOT-bin-20210915-bbb33af2e4/examples/src/main/scala/org/apache/
spark-3.3.0-SNAPSHOT-bin-20210915-bbb33af2e4/examples/src/main/scala/org/apache/spark/
spark-3.3.0-SNAPSHOT-bin-20210915-bbb33af2e4/examples/src/main/scala/org/apache/spark/examples/
spark-3.3.0-SNAPSHOT-bin-20210915-bbb33af2e4/examples/src/main/scala/org/apache/spark/examples/graphx/
spark-3.3.0-SNAPSHOT-bin-20210915-bbb33af2e4/examples/src/main/scala/org/apache/spark/examples/graphx/ComprehensiveExample.scala
spark-3.3.0-SNAPSHOT-bin-20210915-bbb33af2e4/examples/src/main/scala/org/apache/spark/examples/graphx/SynthBenchmark.scala
spark-3.3.0-SNAPSHOT-bin-20210915-bbb33af2e4/examples/src/main/scala/org/apache/spark/examples/graphx/LiveJournalPageRank.scala
spark-3.3.0-SNAPSHOT-bin-20210915-bbb33af2e4/examples/src/main/scala/org/apache/spark/examples/graphx/Analytics.scala
spark-3.3.0-SNAPSHOT-bin-20210915-bbb33af2e4/examples/src/main/scala/org/apache/spark/examples/graphx/AggregateMessagesExample.scala
spark-3.3.0-SNAPSHOT-bin-20210915-bbb33af2e4/examples/src/main/scala/org/apache/spark/examples/graphx/ConnectedComponentsExample.scala
spark-3.3.0-SNAPSHOT-bin-20210915-bbb33af2e4/examples/src/main/scala/org/apache/spark/examples/graphx/PageRankExample.scala
spark-3.3.0-SNAPSHOT-bin-20210915-bbb33af2e4/examples/src/main/scala/org/apache/spark/examples/graphx/SSSPExample.scala
spark-3.3.0-SNAPSHOT-bin-20210915-bbb33af2e4/examples/src/main/scala/org/apache/spark/examples/graphx/TriangleCountingExample.scala
spark-3.3.0-SNAPSHOT-bin-20210915-bbb33af2e4/examples/src/main/scala/org/apache/spark/examples/DriverSubmissionTest.scala
spark-3.3.0-SNAPSHOT-bin-20210915-bbb33af2e4/examples/src/main/scala/org/apache/spark/examples/LogQuery.scala
spark-3.3.0-SNAPSHOT-bin-20210915-bbb33af2e4/examples/src/main/scala/org/apache/spark/examples/GroupByTest.scala
spark-3.3.0-SNAPSHOT-bin-20210915-bbb33af2e4/examples/src/main/scala/org/apache/spark/examples/pythonconverters/
spark-3.3.0-SNAPSHOT-bin-20210915-bbb33af2e4/examples/src/main/scala/org/apache/spark/examples/pythonconverters/AvroConverters.scala
spark-3.3.0-SNAPSHOT-bin-20210915-bbb33af2e4/examples/src/main/scala/org/apache/spark/examples/MiniReadWriteTest.scala
spark-3.3.0-SNAPSHOT-bin-20210915-bbb33af2e4/examples/src/main/scala/org/apache/spark/examples/mllib/
spark-3.3.0-SNAPSHOT-bin-20210915-bbb33af2e4/examples/src/main/scala/org/apache/spark/examples/mllib/KernelDensityEstimationExample.scala
spark-3.3.0-SNAPSHOT-bin-20210915-bbb33af2e4/examples/src/main/scala/org/apache/spark/examples/mllib/AssociationRulesExample.scala
spark-3.3.0-SNAPSHOT-bin-20210915-bbb33af2e4/examples/src/main/scala/org/apache/spark/examples/mllib/DecisionTreeClassificationExample.scala
spark-3.3.0-SNAPSHOT-bin-20210915-bbb33af2e4/examples/src/main/scala/org/apache/spark/examples/mllib/MultivariateSummarizer.scala
spark-3.3.0-SNAPSHOT-bin-20210915-bbb33af2e4/examples/src/main/scala/org/apache/spark/examples/mllib/RankingMetricsExample.scala
spark-3.3.0-SNAPSHOT-bin-20210915-bbb33af2e4/examples/src/main/scala/org/apache/spark/examples/mllib/MultiLabelMetricsExample.scala
spark-3.3.0-SNAPSHOT-bin-20210915-bbb33af2e4/examples/src/main/scala/org/apache/spark/examples/mllib/LBFGSExample.scala
spark-3.3.0-SNAPSHOT-bin-20210915-bbb33af2e4/examples/src/main/scala/org/apache/spark/examples/mllib/CorrelationsExample.scala
spark-3.3.0-SNAPSHOT-bin-20210915-bbb33af2e4/examples/src/main/scala/org/apache/spark/examples/mllib/KMeansExample.scala
spark-3.3.0-SNAPSHOT-bin-20210915-bbb33af2e4/examples/src/main/scala/org/apache/spark/examples/mllib/DecisionTreeRegressionExample.scala
spark-3.3.0-SNAPSHOT-bin-20210915-bbb33af2e4/examples/src/main/scala/org/apache/spark/examples/mllib/StreamingLinearRegressionExample.scala
spark-3.3.0-SNAPSHOT-bin-20210915-bbb33af2e4/examples/src/main/scala/org/apache/spark/examples/mllib/ElementwiseProductExample.scala
spark-3.3.0-SNAPSHOT-bin-20210915-bbb33af2e4/examples/src/main/scala/org/apache/spark/examples/mllib/GradientBoostingClassificationExample.scala
spark-3.3.0-SNAPSHOT-bin-20210915-bbb33af2e4/examples/src/main/scala/org/apache/spark/examples/mllib/DecisionTreeRunner.scala
spark-3.3.0-SNAPSHOT-bin-20210915-bbb33af2e4/examples/src/main/scala/org/apache/spark/examples/mllib/StreamingTestExample.scala
spark-3.3.0-SNAPSHOT-bin-20210915-bbb33af2e4/examples/src/main/scala/org/apache/spark/examples/mllib/SummaryStatisticsExample.scala
spark-3.3.0-SNAPSHOT-bin-20210915-bbb33af2e4/examples/src/main/scala/org/apache/spark/examples/mllib/DenseKMeans.scala
spark-3.3.0-SNAPSHOT-bin-20210915-bbb33af2e4/examples/src/main/scala/org/apache/spark/examples/mllib/HypothesisTestingExample.scala
spark-3.3.0-SNAPSHOT-bin-20210915-bbb33af2e4/examples/src/main/scala/org/apache/spark/examples/mllib/Word2VecExample.scala
spark-3.3.0-SNAPSHOT-bin-20210915-bbb33af2e4/examples/src/main/scala/org/apache/spark/examples/mllib/TallSkinnyPCA.scala
spark-3.3.0-SNAPSHOT-bin-20210915-bbb33af2e4/examples/src/main/scala/org/apache/spark/examples/mllib/MovieLensALS.scala
spark-3.3.0-SNAPSHOT-bin-20210915-bbb33af2e4/examples/src/main/scala/org/apache/spark/examples/mllib/TFIDFExample.scala
spark-3.3.0-SNAPSHOT-bin-20210915-bbb33af2e4/examples/src/main/scala/org/apache/spark/examples/mllib/PCAOnSourceVectorExample.scala
spark-3.3.0-SNAPSHOT-bin-20210915-bbb33af2e4/examples/src/main/scala/org/apache/spark/examples/mllib/RandomForestClassificationExample.scala
spark-3.3.0-SNAPSHOT-bin-20210915-bbb33af2e4/examples/src/main/scala/org/apache/spark/examples/mllib/SVDExample.scala
spark-3.3.0-SNAPSHOT-bin-20210915-bbb33af2e4/examples/src/main/scala/org/apache/spark/examples/mllib/StratifiedSamplingExample.scala
spark-3.3.0-SNAPSHOT-bin-20210915-bbb33af2e4/examples/src/main/scala/org/apache/spark/examples/mllib/HypothesisTestingKolmogorovSmirnovTestExample.scala
spark-3.3.0-SNAPSHOT-bin-20210915-bbb33af2e4/examples/src/main/scala/org/apache/spark/examples/mllib/TallSkinnySVD.scala
spark-3.3.0-SNAPSHOT-bin-20210915-bbb33af2e4/examples/src/main/scala/org/apache/spark/examples/mllib/IsotonicRegressionExample.scala
spark-3.3.0-SNAPSHOT-bin-20210915-bbb33af2e4/examples/src/main/scala/org/apache/spark/examples/mllib/FPGrowthExample.scala
spark-3.3.0-SNAPSHOT-bin-20210915-bbb33af2e4/examples/src/main/scala/org/apache/spark/examples/mllib/LDAExample.scala
spark-3.3.0-SNAPSHOT-bin-20210915-bbb33af2e4/examples/src/main/scala/org/apache/spark/examples/mllib/StreamingKMeansExample.scala
spark-3.3.0-SNAPSHOT-bin-20210915-bbb33af2e4/examples/src/main/scala/org/apache/spark/examples/mllib/Correlations.scala
spark-3.3.0-SNAPSHOT-bin-20210915-bbb33af2e4/examples/src/main/scala/org/apache/spark/examples/mllib/NormalizerExample.scala
spark-3.3.0-SNAPSHOT-bin-20210915-bbb33af2e4/examples/src/main/scala/org/apache/spark/examples/mllib/RecommendationExample.scala
spark-3.3.0-SNAPSHOT-bin-20210915-bbb33af2e4/examples/src/main/scala/org/apache/spark/examples/mllib/PMMLModelExportExample.scala
spark-3.3.0-SNAPSHOT-bin-20210915-bbb33af2e4/examples/src/main/scala/org/apache/spark/examples/mllib/RandomRDDGeneration.scala
spark-3.3.0-SNAPSHOT-bin-20210915-bbb33af2e4/examples/src/main/scala/org/apache/spark/examples/mllib/SparseNaiveBayes.scala
spark-3.3.0-SNAPSHOT-bin-20210915-bbb33af2e4/examples/src/main/scala/org/apache/spark/examples/mllib/MulticlassMetricsExample.scala
spark-3.3.0-SNAPSHOT-bin-20210915-bbb33af2e4/examples/src/main/scala/org/apache/spark/examples/mllib/StandardScalerExample.scala
spark-3.3.0-SNAPSHOT-bin-20210915-bbb33af2e4/examples/src/main/scala/org/apache/spark/examples/mllib/GaussianMixtureExample.scala
spark-3.3.0-SNAPSHOT-bin-20210915-bbb33af2e4/examples/src/main/scala/org/apache/spark/examples/mllib/LogisticRegressionWithLBFGSExample.scala
spark-3.3.0-SNAPSHOT-bin-20210915-bbb33af2e4/examples/src/main/scala/org/apache/spark/examples/mllib/SampledRDDs.scala
spark-3.3.0-SNAPSHOT-bin-20210915-bbb33af2e4/examples/src/main/scala/org/apache/spark/examples/mllib/ChiSqSelectorExample.scala
spark-3.3.0-SNAPSHOT-bin-20210915-bbb33af2e4/examples/src/main/scala/org/apache/spark/examples/mllib/RandomForestRegressionExample.scala
spark-3.3.0-SNAPSHOT-bin-20210915-bbb33af2e4/examples/src/main/scala/org/apache/spark/examples/mllib/StreamingLogisticRegression.scala
spark-3.3.0-SNAPSHOT-bin-20210915-bbb33af2e4/examples/src/main/scala/org/apache/spark/examples/mllib/BinaryClassificationMetricsExample.scala
spark-3.3.0-SNAPSHOT-bin-20210915-bbb33af2e4/examples/src/main/scala/org/apache/spark/examples/mllib/PowerIterationClusteringExample.scala
spark-3.3.0-SNAPSHOT-bin-20210915-bbb33af2e4/examples/src/main/scala/org/apache/spark/examples/mllib/PCAOnRowMatrixExample.scala
spark-3.3.0-SNAPSHOT-bin-20210915-bbb33af2e4/examples/src/main/scala/org/apache/spark/examples/mllib/SimpleFPGrowth.scala
spark-3.3.0-SNAPSHOT-bin-20210915-bbb33af2e4/examples/src/main/scala/org/apache/spark/examples/mllib/SVMWithSGDExample.scala
spark-3.3.0-SNAPSHOT-bin-20210915-bbb33af2e4/examples/src/main/scala/org/apache/spark/examples/mllib/BinaryClassification.scala
spark-3.3.0-SNAPSHOT-bin-20210915-bbb33af2e4/examples/src/main/scala/org/apache/spark/examples/mllib/CosineSimilarity.scala
spark-3.3.0-SNAPSHOT-bin-20210915-bbb33af2e4/examples/src/main/scala/org/apache/spark/examples/mllib/BisectingKMeansExample.scala
spark-3.3.0-SNAPSHOT-bin-20210915-bbb33af2e4/examples/src/main/scala/org/apache/spark/examples/mllib/AbstractParams.scala
spark-3.3.0-SNAPSHOT-bin-20210915-bbb33af2e4/examples/src/main/scala/org/apache/spark/examples/mllib/NaiveBayesExample.scala
spark-3.3.0-SNAPSHOT-bin-20210915-bbb33af2e4/examples/src/main/scala/org/apache/spark/examples/mllib/LatentDirichletAllocationExample.scala
spark-3.3.0-SNAPSHOT-bin-20210915-bbb33af2e4/examples/src/main/scala/org/apache/spark/examples/mllib/GradientBoostedTreesRunner.scala
spark-3.3.0-SNAPSHOT-bin-20210915-bbb33af2e4/examples/src/main/scala/org/apache/spark/examples/mllib/PrefixSpanExample.scala
spark-3.3.0-SNAPSHOT-bin-20210915-bbb33af2e4/examples/src/main/scala/org/apache/spark/examples/mllib/GradientBoostingRegressionExample.scala
spark-3.3.0-SNAPSHOT-bin-20210915-bbb33af2e4/examples/src/main/scala/org/apache/spark/examples/AccumulatorMetricsTest.scala
spark-3.3.0-SNAPSHOT-bin-20210915-bbb33af2e4/examples/src/main/scala/org/apache/spark/examples/extensions/
spark-3.3.0-SNAPSHOT-bin-20210915-bbb33af2e4/examples/src/main/scala/org/apache/spark/examples/extensions/SessionExtensionsWithLoader.scala
spark-3.3.0-SNAPSHOT-bin-20210915-bbb33af2e4/examples/src/main/scala/org/apache/spark/examples/extensions/AgeExample.scala
spark-3.3.0-SNAPSHOT-bin-20210915-bbb33af2e4/examples/src/main/scala/org/apache/spark/examples/extensions/SessionExtensionsWithoutLoader.scala
spark-3.3.0-SNAPSHOT-bin-20210915-bbb33af2e4/examples/src/main/scala/org/apache/spark/examples/extensions/SparkSessionExtensionsTest.scala
spark-3.3.0-SNAPSHOT-bin-20210915-bbb33af2e4/examples/src/main/scala/org/apache/spark/examples/HdfsTest.scala
spark-3.3.0-SNAPSHOT-bin-20210915-bbb33af2e4/examples/src/main/scala/org/apache/spark/examples/sql/
spark-3.3.0-SNAPSHOT-bin-20210915-bbb33af2e4/examples/src/main/scala/org/apache/spark/examples/sql/streaming/
spark-3.3.0-SNAPSHOT-bin-20210915-bbb33af2e4/examples/src/main/scala/org/apache/spark/examples/sql/streaming/StructuredNetworkWordCountWindowed.scala
spark-3.3.0-SNAPSHOT-bin-20210915-bbb33af2e4/examples/src/main/scala/org/apache/spark/examples/sql/streaming/StructuredComplexSessionization.scala
spark-3.3.0-SNAPSHOT-bin-20210915-bbb33af2e4/examples/src/main/scala/org/apache/spark/examples/sql/streaming/StructuredSessionization.scala
spark-3.3.0-SNAPSHOT-bin-20210915-bbb33af2e4/examples/src/main/scala/org/apache/spark/examples/sql/streaming/StructuredKerberizedKafkaWordCount.scala
spark-3.3.0-SNAPSHOT-bin-20210915-bbb33af2e4/examples/src/main/scala/org/apache/spark/examples/sql/streaming/StructuredNetworkWordCount.scala
spark-3.3.0-SNAPSHOT-bin-20210915-bbb33af2e4/examples/src/main/scala/org/apache/spark/examples/sql/streaming/StructuredKafkaWordCount.scala
spark-3.3.0-SNAPSHOT-bin-20210915-bbb33af2e4/examples/src/main/scala/org/apache/spark/examples/sql/SparkSQLExample.scala
spark-3.3.0-SNAPSHOT-bin-20210915-bbb33af2e4/examples/src/main/scala/org/apache/spark/examples/sql/hive/
spark-3.3.0-SNAPSHOT-bin-20210915-bbb33af2e4/examples/src/main/scala/org/apache/spark/examples/sql/hive/SparkHiveExample.scala
spark-3.3.0-SNAPSHOT-bin-20210915-bbb33af2e4/examples/src/main/scala/org/apache/spark/examples/sql/RDDRelation.scala
spark-3.3.0-SNAPSHOT-bin-20210915-bbb33af2e4/examples/src/main/scala/org/apache/spark/examples/sql/SimpleTypedAggregator.scala
spark-3.3.0-SNAPSHOT-bin-20210915-bbb33af2e4/examples/src/main/scala/org/apache/spark/examples/sql/UserDefinedTypedAggregation.scala
spark-3.3.0-SNAPSHOT-bin-20210915-bbb33af2e4/examples/src/main/scala/org/apache/spark/examples/sql/UserDefinedUntypedAggregation.scala
spark-3.3.0-SNAPSHOT-bin-20210915-bbb33af2e4/examples/src/main/scala/org/apache/spark/examples/sql/jdbc/
spark-3.3.0-SNAPSHOT-bin-20210915-bbb33af2e4/examples/src/main/scala/org/apache/spark/examples/sql/jdbc/ExampleJdbcConnectionProvider.scala
spark-3.3.0-SNAPSHOT-bin-20210915-bbb33af2e4/examples/src/main/scala/org/apache/spark/examples/sql/UserDefinedScalar.scala
spark-3.3.0-SNAPSHOT-bin-20210915-bbb33af2e4/examples/src/main/scala/org/apache/spark/examples/sql/SQLDataSourceExample.scala
spark-3.3.0-SNAPSHOT-bin-20210915-bbb33af2e4/examples/src/main/scala/org/apache/spark/examples/SparkLR.scala
spark-3.3.0-SNAPSHOT-bin-20210915-bbb33af2e4/examples/src/main/scala/org/apache/spark/examples/LocalPi.scala
spark-3.3.0-SNAPSHOT-bin-20210915-bbb33af2e4/examples/src/main/scala/org/apache/spark/examples/SkewedGroupByTest.scala
spark-3.3.0-SNAPSHOT-bin-20210915-bbb33af2e4/examples/src/main/scala/org/apache/spark/examples/MultiBroadcastTest.scala
spark-3.3.0-SNAPSHOT-bin-20210915-bbb33af2e4/examples/src/main/scala/org/apache/spark/examples/SparkKMeans.scala
spark-3.3.0-SNAPSHOT-bin-20210915-bbb33af2e4/examples/src/main/scala/org/apache/spark/examples/SparkHdfsLR.scala
spark-3.3.0-SNAPSHOT-bin-20210915-bbb33af2e4/examples/src/main/scala/org/apache/spark/examples/SparkPageRank.scala
spark-3.3.0-SNAPSHOT-bin-20210915-bbb33af2e4/examples/src/main/scala/org/apache/spark/examples/ExceptionHandlingTest.scala
spark-3.3.0-SNAPSHOT-bin-20210915-bbb33af2e4/examples/src/main/scala/org/apache/spark/examples/LocalALS.scala
spark-3.3.0-SNAPSHOT-bin-20210915-bbb33af2e4/examples/src/main/scala/org/apache/spark/examples/SimpleSkewedGroupByTest.scala
spark-3.3.0-SNAPSHOT-bin-20210915-bbb33af2e4/examples/src/main/scala/org/apache/spark/examples/BroadcastTest.scala
spark-3.3.0-SNAPSHOT-bin-20210915-bbb33af2e4/examples/src/main/scala/org/apache/spark/examples/SparkRemoteFileTest.scala
spark-3.3.0-SNAPSHOT-bin-20210915-bbb33af2e4/examples/src/main/scala/org/apache/spark/examples/LocalFileLR.scala
spark-3.3.0-SNAPSHOT-bin-20210915-bbb33af2e4/examples/src/main/scala/org/apache/spark/examples/SparkALS.scala
spark-3.3.0-SNAPSHOT-bin-20210915-bbb33af2e4/examples/src/main/scala/org/apache/spark/examples/ml/
spark-3.3.0-SNAPSHOT-bin-20210915-bbb33af2e4/examples/src/main/scala/org/apache/spark/examples/ml/LogisticRegressionSummaryExample.scala
spark-3.3.0-SNAPSHOT-bin-20210915-bbb33af2e4/examples/src/main/scala/org/apache/spark/examples/ml/BucketedRandomProjectionLSHExample.scala
spark-3.3.0-SNAPSHOT-bin-20210915-bbb33af2e4/examples/src/main/scala/org/apache/spark/examples/ml/TfIdfExample.scala
spark-3.3.0-SNAPSHOT-bin-20210915-bbb33af2e4/examples/src/main/scala/org/apache/spark/examples/ml/LinearRegressionWithElasticNetExample.scala
spark-3.3.0-SNAPSHOT-bin-20210915-bbb33af2e4/examples/src/main/scala/org/apache/spark/examples/ml/LinearRegressionExample.scala
spark-3.3.0-SNAPSHOT-bin-20210915-bbb33af2e4/examples/src/main/scala/org/apache/spark/examples/ml/DecisionTreeClassificationExample.scala
spark-3.3.0-SNAPSHOT-bin-20210915-bbb33af2e4/examples/src/main/scala/org/apache/spark/examples/ml/DCTExample.scala
spark-3.3.0-SNAPSHOT-bin-20210915-bbb33af2e4/examples/src/main/scala/org/apache/spark/examples/ml/RobustScalerExample.scala
spark-3.3.0-SNAPSHOT-bin-20210915-bbb33af2e4/examples/src/main/scala/org/apache/spark/examples/ml/ModelSelectionViaTrainValidationSplitExample.scala
spark-3.3.0-SNAPSHOT-bin-20210915-bbb33af2e4/examples/src/main/scala/org/apache/spark/examples/ml/EstimatorTransformerParamExample.scala
spark-3.3.0-SNAPSHOT-bin-20210915-bbb33af2e4/examples/src/main/scala/org/apache/spark/examples/ml/VectorSlicerExample.scala
spark-3.3.0-SNAPSHOT-bin-20210915-bbb33af2e4/examples/src/main/scala/org/apache/spark/examples/ml/IndexToStringExample.scala
spark-3.3.0-SNAPSHOT-bin-20210915-bbb33af2e4/examples/src/main/scala/org/apache/spark/examples/ml/FeatureHasherExample.scala
spark-3.3.0-SNAPSHOT-bin-20210915-bbb33af2e4/examples/src/main/scala/org/apache/spark/examples/ml/MinHashLSHExample.scala
spark-3.3.0-SNAPSHOT-bin-20210915-bbb33af2e4/examples/src/main/scala/org/apache/spark/examples/ml/MinMaxScalerExample.scala
spark-3.3.0-SNAPSHOT-bin-20210915-bbb33af2e4/examples/src/main/scala/org/apache/spark/examples/ml/RFormulaExample.scala
spark-3.3.0-SNAPSHOT-bin-20210915-bbb33af2e4/examples/src/main/scala/org/apache/spark/examples/ml/SQLTransformerExample.scala
spark-3.3.0-SNAPSHOT-bin-20210915-bbb33af2e4/examples/src/main/scala/org/apache/spark/examples/ml/LogisticRegressionExample.scala
spark-3.3.0-SNAPSHOT-bin-20210915-bbb33af2e4/examples/src/main/scala/org/apache/spark/examples/ml/LDAExample.scala
spark-3.3.0-SNAPSHOT-bin-20210915-bbb33af2e4/examples/src/main/scala/org/apache/spark/examples/ml/KMeansExample.scala
spark-3.3.0-SNAPSHOT-bin-20210915-bbb33af2e4/examples/src/main/scala/org/apache/spark/examples/ml/ALSExample.scala
spark-3.3.0-SNAPSHOT-bin-20210915-bbb33af2e4/examples/src/main/scala/org/apache/spark/examples/ml/SummarizerExample.scala
spark-3.3.0-SNAPSHOT-bin-20210915-bbb33af2e4/examples/src/main/scala/org/apache/spark/examples/ml/PolynomialExpansionExample.scala
spark-3.3.0-SNAPSHOT-bin-20210915-bbb33af2e4/examples/src/main/scala/org/apache/spark/examples/ml/DeveloperApiExample.scala
spark-3.3.0-SNAPSHOT-bin-20210915-bbb33af2e4/examples/src/main/scala/org/apache/spark/examples/ml/FMRegressorExample.scala
spark-3.3.0-SNAPSHOT-bin-20210915-bbb33af2e4/examples/src/main/scala/org/apache/spark/examples/ml/GradientBoostedTreeClassifierExample.scala
spark-3.3.0-SNAPSHOT-bin-20210915-bbb33af2e4/examples/src/main/scala/org/apache/spark/examples/ml/GBTExample.scala
spark-3.3.0-SNAPSHOT-bin-20210915-bbb33af2e4/examples/src/main/scala/org/apache/spark/examples/ml/RandomForestExample.scala
spark-3.3.0-SNAPSHOT-bin-20210915-bbb33af2e4/examples/src/main/scala/org/apache/spark/examples/ml/RandomForestClassifierExample.scala
spark-3.3.0-SNAPSHOT-bin-20210915-bbb33af2e4/examples/src/main/scala/org/apache/spark/examples/ml/InteractionExample.scala
spark-3.3.0-SNAPSHOT-bin-20210915-bbb33af2e4/examples/src/main/scala/org/apache/spark/examples/ml/CorrelationExample.scala
spark-3.3.0-SNAPSHOT-bin-20210915-bbb33af2e4/examples/src/main/scala/org/apache/spark/examples/ml/StringIndexerExample.scala
spark-3.3.0-SNAPSHOT-bin-20210915-bbb33af2e4/examples/src/main/scala/org/apache/spark/examples/ml/OneVsRestExample.scala
spark-3.3.0-SNAPSHOT-bin-20210915-bbb33af2e4/examples/src/main/scala/org/apache/spark/examples/ml/PCAExample.scala
spark-3.3.0-SNAPSHOT-bin-20210915-bbb33af2e4/examples/src/main/scala/org/apache/spark/examples/ml/OneHotEncoderExample.scala
spark-3.3.0-SNAPSHOT-bin-20210915-bbb33af2e4/examples/src/main/scala/org/apache/spark/examples/ml/QuantileDiscretizerExample.scala
spark-3.3.0-SNAPSHOT-bin-20210915-bbb33af2e4/examples/src/main/scala/org/apache/spark/examples/ml/RandomForestRegressorExample.scala
spark-3.3.0-SNAPSHOT-bin-20210915-bbb33af2e4/examples/src/main/scala/org/apache/spark/examples/ml/MulticlassLogisticRegressionWithElasticNetExample.scala
spark-3.3.0-SNAPSHOT-bin-20210915-bbb33af2e4/examples/src/main/scala/org/apache/spark/examples/ml/ChiSquareTestExample.scala
spark-3.3.0-SNAPSHOT-bin-20210915-bbb33af2e4/examples/src/main/scala/org/apache/spark/examples/ml/GaussianMixtureExample.scala
spark-3.3.0-SNAPSHOT-bin-20210915-bbb33af2e4/examples/src/main/scala/org/apache/spark/examples/ml/BucketizerExample.scala
spark-3.3.0-SNAPSHOT-bin-20210915-bbb33af2e4/examples/src/main/scala/org/apache/spark/examples/ml/StopWordsRemoverExample.scala
spark-3.3.0-SNAPSHOT-bin-20210915-bbb33af2e4/examples/src/main/scala/org/apache/spark/examples/ml/IsotonicRegressionExample.scala
spark-3.3.0-SNAPSHOT-bin-20210915-bbb33af2e4/examples/src/main/scala/org/apache/spark/examples/ml/LogisticRegressionWithElasticNetExample.scala
spark-3.3.0-SNAPSHOT-bin-20210915-bbb33af2e4/examples/src/main/scala/org/apache/spark/examples/ml/VectorIndexerExample.scala
spark-3.3.0-SNAPSHOT-bin-20210915-bbb33af2e4/examples/src/main/scala/org/apache/spark/examples/ml/LinearSVCExample.scala
spark-3.3.0-SNAPSHOT-bin-20210915-bbb33af2e4/examples/src/main/scala/org/apache/spark/examples/ml/VectorSizeHintExample.scala
spark-3.3.0-SNAPSHOT-bin-20210915-bbb33af2e4/examples/src/main/scala/org/apache/spark/examples/ml/PipelineExample.scala
spark-3.3.0-SNAPSHOT-bin-20210915-bbb33af2e4/examples/src/main/scala/org/apache/spark/examples/ml/NormalizerExample.scala
spark-3.3.0-SNAPSHOT-bin-20210915-bbb33af2e4/examples/src/main/scala/org/apache/spark/examples/ml/BinarizerExample.scala
spark-3.3.0-SNAPSHOT-bin-20210915-bbb33af2e4/examples/src/main/scala/org/apache/spark/examples/ml/DataFrameExample.scala
spark-3.3.0-SNAPSHOT-bin-20210915-bbb33af2e4/examples/src/main/scala/org/apache/spark/examples/ml/PrefixSpanExample.scala
spark-3.3.0-SNAPSHOT-bin-20210915-bbb33af2e4/examples/src/main/scala/org/apache/spark/examples/ml/MaxAbsScalerExample.scala
spark-3.3.0-SNAPSHOT-bin-20210915-bbb33af2e4/examples/src/main/scala/org/apache/spark/examples/ml/NaiveBayesExample.scala
spark-3.3.0-SNAPSHOT-bin-20210915-bbb33af2e4/examples/src/main/scala/org/apache/spark/examples/ml/ChiSqSelectorExample.scala
spark-3.3.0-SNAPSHOT-bin-20210915-bbb33af2e4/examples/src/main/scala/org/apache/spark/examples/ml/NGramExample.scala
spark-3.3.0-SNAPSHOT-bin-20210915-bbb33af2e4/examples/src/main/scala/org/apache/spark/examples/ml/ImputerExample.scala
spark-3.3.0-SNAPSHOT-bin-20210915-bbb33af2e4/examples/src/main/scala/org/apache/spark/examples/ml/PowerIterationClusteringExample.scala
spark-3.3.0-SNAPSHOT-bin-20210915-bbb33af2e4/examples/src/main/scala/org/apache/spark/examples/ml/GeneralizedLinearRegressionExample.scala
spark-3.3.0-SNAPSHOT-bin-20210915-bbb33af2e4/examples/src/main/scala/org/apache/spark/examples/ml/FPGrowthExample.scala
spark-3.3.0-SNAPSHOT-bin-20210915-bbb33af2e4/examples/src/main/scala/org/apache/spark/examples/ml/FMClassifierExample.scala
spark-3.3.0-SNAPSHOT-bin-20210915-bbb33af2e4/examples/src/main/scala/org/apache/spark/examples/ml/AFTSurvivalRegressionExample.scala
spark-3.3.0-SNAPSHOT-bin-20210915-bbb33af2e4/examples/src/main/scala/org/apache/spark/examples/ml/BisectingKMeansExample.scala
spark-3.3.0-SNAPSHOT-bin-20210915-bbb33af2e4/examples/src/main/scala/org/apache/spark/examples/ml/GradientBoostedTreeRegressorExample.scala
spark-3.3.0-SNAPSHOT-bin-20210915-bbb33af2e4/examples/src/main/scala/org/apache/spark/examples/ml/UnivariateFeatureSelectorExample.scala
spark-3.3.0-SNAPSHOT-bin-20210915-bbb33af2e4/examples/src/main/scala/org/apache/spark/examples/ml/VarianceThresholdSelectorExample.scala
spark-3.3.0-SNAPSHOT-bin-20210915-bbb33af2e4/examples/src/main/scala/org/apache/spark/examples/ml/Word2VecExample.scala
spark-3.3.0-SNAPSHOT-bin-20210915-bbb33af2e4/examples/src/main/scala/org/apache/spark/examples/ml/VectorAssemblerExample.scala
spark-3.3.0-SNAPSHOT-bin-20210915-bbb33af2e4/examples/src/main/scala/org/apache/spark/examples/ml/CountVectorizerExample.scala
spark-3.3.0-SNAPSHOT-bin-20210915-bbb33af2e4/examples/src/main/scala/org/apache/spark/examples/ml/TokenizerExample.scala
spark-3.3.0-SNAPSHOT-bin-20210915-bbb33af2e4/examples/src/main/scala/org/apache/spark/examples/ml/DecisionTreeRegressionExample.scala
spark-3.3.0-SNAPSHOT-bin-20210915-bbb33af2e4/examples/src/main/scala/org/apache/spark/examples/ml/StandardScalerExample.scala
spark-3.3.0-SNAPSHOT-bin-20210915-bbb33af2e4/examples/src/main/scala/org/apache/spark/examples/ml/ElementwiseProductExample.scala
spark-3.3.0-SNAPSHOT-bin-20210915-bbb33af2e4/examples/src/main/scala/org/apache/spark/examples/ml/ModelSelectionViaCrossValidationExample.scala
spark-3.3.0-SNAPSHOT-bin-20210915-bbb33af2e4/examples/src/main/scala/org/apache/spark/examples/ml/DecisionTreeExample.scala
spark-3.3.0-SNAPSHOT-bin-20210915-bbb33af2e4/examples/src/main/scala/org/apache/spark/examples/ml/UnaryTransformerExample.scala
spark-3.3.0-SNAPSHOT-bin-20210915-bbb33af2e4/examples/src/main/scala/org/apache/spark/examples/ml/MultilayerPerceptronClassifierExample.scala
spark-3.3.0-SNAPSHOT-bin-20210915-bbb33af2e4/examples/src/main/scala/org/apache/spark/examples/SparkTC.scala
spark-3.3.0-SNAPSHOT-bin-20210915-bbb33af2e4/examples/src/main/scala/org/apache/spark/examples/streaming/
spark-3.3.0-SNAPSHOT-bin-20210915-bbb33af2e4/examples/src/main/scala/org/apache/spark/examples/streaming/QueueStream.scala
spark-3.3.0-SNAPSHOT-bin-20210915-bbb33af2e4/examples/src/main/scala/org/apache/spark/examples/streaming/CustomReceiver.scala
spark-3.3.0-SNAPSHOT-bin-20210915-bbb33af2e4/examples/src/main/scala/org/apache/spark/examples/streaming/RawNetworkGrep.scala
spark-3.3.0-SNAPSHOT-bin-20210915-bbb33af2e4/examples/src/main/scala/org/apache/spark/examples/streaming/RecoverableNetworkWordCount.scala
spark-3.3.0-SNAPSHOT-bin-20210915-bbb33af2e4/examples/src/main/scala/org/apache/spark/examples/streaming/clickstream/
spark-3.3.0-SNAPSHOT-bin-20210915-bbb33af2e4/examples/src/main/scala/org/apache/spark/examples/streaming/clickstream/PageViewGenerator.scala
spark-3.3.0-SNAPSHOT-bin-20210915-bbb33af2e4/examples/src/main/scala/org/apache/spark/examples/streaming/clickstream/PageViewStream.scala
spark-3.3.0-SNAPSHOT-bin-20210915-bbb33af2e4/examples/src/main/scala/org/apache/spark/examples/streaming/NetworkWordCount.scala
spark-3.3.0-SNAPSHOT-bin-20210915-bbb33af2e4/examples/src/main/scala/org/apache/spark/examples/streaming/DirectKafkaWordCount.scala
spark-3.3.0-SNAPSHOT-bin-20210915-bbb33af2e4/examples/src/main/scala/org/apache/spark/examples/streaming/StatefulNetworkWordCount.scala
spark-3.3.0-SNAPSHOT-bin-20210915-bbb33af2e4/examples/src/main/scala/org/apache/spark/examples/streaming/HdfsWordCount.scala
spark-3.3.0-SNAPSHOT-bin-20210915-bbb33af2e4/examples/src/main/scala/org/apache/spark/examples/streaming/SqlNetworkWordCount.scala
spark-3.3.0-SNAPSHOT-bin-20210915-bbb33af2e4/examples/src/main/scala/org/apache/spark/examples/streaming/StreamingExamples.scala
spark-3.3.0-SNAPSHOT-bin-20210915-bbb33af2e4/examples/src/main/scala/org/apache/spark/examples/streaming/DirectKerberizedKafkaWordCount.scala
spark-3.3.0-SNAPSHOT-bin-20210915-bbb33af2e4/examples/src/main/scala/org/apache/spark/examples/SparkPi.scala
spark-3.3.0-SNAPSHOT-bin-20210915-bbb33af2e4/examples/src/main/scala/org/apache/spark/examples/LocalLR.scala
spark-3.3.0-SNAPSHOT-bin-20210915-bbb33af2e4/examples/src/main/scala/org/apache/spark/examples/LocalKMeans.scala
spark-3.3.0-SNAPSHOT-bin-20210915-bbb33af2e4/examples/src/main/scala/org/apache/spark/examples/DFSReadWriteTest.scala
spark-3.3.0-SNAPSHOT-bin-20210915-bbb33af2e4/examples/src/main/python/
spark-3.3.0-SNAPSHOT-bin-20210915-bbb33af2e4/examples/src/main/python/sort.py
spark-3.3.0-SNAPSHOT-bin-20210915-bbb33af2e4/examples/src/main/python/als.py
spark-3.3.0-SNAPSHOT-bin-20210915-bbb33af2e4/examples/src/main/python/avro_inputformat.py
spark-3.3.0-SNAPSHOT-bin-20210915-bbb33af2e4/examples/src/main/python/pi.py
spark-3.3.0-SNAPSHOT-bin-20210915-bbb33af2e4/examples/src/main/python/kmeans.py
spark-3.3.0-SNAPSHOT-bin-20210915-bbb33af2e4/examples/src/main/python/sql/
spark-3.3.0-SNAPSHOT-bin-20210915-bbb33af2e4/examples/src/main/python/sql/streaming/
spark-3.3.0-SNAPSHOT-bin-20210915-bbb33af2e4/examples/src/main/python/sql/streaming/structured_sessionization.py
spark-3.3.0-SNAPSHOT-bin-20210915-bbb33af2e4/examples/src/main/python/sql/streaming/structured_network_wordcount_windowed.py
spark-3.3.0-SNAPSHOT-bin-20210915-bbb33af2e4/examples/src/main/python/sql/streaming/structured_network_wordcount.py
spark-3.3.0-SNAPSHOT-bin-20210915-bbb33af2e4/examples/src/main/python/sql/streaming/structured_kafka_wordcount.py
spark-3.3.0-SNAPSHOT-bin-20210915-bbb33af2e4/examples/src/main/python/sql/hive.py
spark-3.3.0-SNAPSHOT-bin-20210915-bbb33af2e4/examples/src/main/python/sql/basic.py
spark-3.3.0-SNAPSHOT-bin-20210915-bbb33af2e4/examples/src/main/python/sql/arrow.py
spark-3.3.0-SNAPSHOT-bin-20210915-bbb33af2e4/examples/src/main/python/sql/datasource.py
spark-3.3.0-SNAPSHOT-bin-20210915-bbb33af2e4/examples/src/main/python/parquet_inputformat.py
spark-3.3.0-SNAPSHOT-bin-20210915-bbb33af2e4/examples/src/main/python/pagerank.py
spark-3.3.0-SNAPSHOT-bin-20210915-bbb33af2e4/examples/src/main/python/logistic_regression.py
spark-3.3.0-SNAPSHOT-bin-20210915-bbb33af2e4/examples/src/main/python/ml/
spark-3.3.0-SNAPSHOT-bin-20210915-bbb33af2e4/examples/src/main/python/ml/bucketed_random_projection_lsh_example.py
spark-3.3.0-SNAPSHOT-bin-20210915-bbb33af2e4/examples/src/main/python/ml/imputer_example.py
spark-3.3.0-SNAPSHOT-bin-20210915-bbb33af2e4/examples/src/main/python/ml/quantile_discretizer_example.py
spark-3.3.0-SNAPSHOT-bin-20210915-bbb33af2e4/examples/src/main/python/ml/prefixspan_example.py
spark-3.3.0-SNAPSHOT-bin-20210915-bbb33af2e4/examples/src/main/python/ml/word2vec_example.py
spark-3.3.0-SNAPSHOT-bin-20210915-bbb33af2e4/examples/src/main/python/ml/gradient_boosted_tree_classifier_example.py
spark-3.3.0-SNAPSHOT-bin-20210915-bbb33af2e4/examples/src/main/python/ml/tokenizer_example.py
spark-3.3.0-SNAPSHOT-bin-20210915-bbb33af2e4/examples/src/main/python/ml/naive_bayes_example.py
spark-3.3.0-SNAPSHOT-bin-20210915-bbb33af2e4/examples/src/main/python/ml/random_forest_classifier_example.py
spark-3.3.0-SNAPSHOT-bin-20210915-bbb33af2e4/examples/src/main/python/ml/linear_regression_with_elastic_net.py
spark-3.3.0-SNAPSHOT-bin-20210915-bbb33af2e4/examples/src/main/python/ml/sql_transformer.py
spark-3.3.0-SNAPSHOT-bin-20210915-bbb33af2e4/examples/src/main/python/ml/max_abs_scaler_example.py
spark-3.3.0-SNAPSHOT-bin-20210915-bbb33af2e4/examples/src/main/python/ml/summarizer_example.py
spark-3.3.0-SNAPSHOT-bin-20210915-bbb33af2e4/examples/src/main/python/ml/cross_validator.py
spark-3.3.0-SNAPSHOT-bin-20210915-bbb33af2e4/examples/src/main/python/ml/logistic_regression_with_elastic_net.py
spark-3.3.0-SNAPSHOT-bin-20210915-bbb33af2e4/examples/src/main/python/ml/rformula_example.py
spark-3.3.0-SNAPSHOT-bin-20210915-bbb33af2e4/examples/src/main/python/ml/tf_idf_example.py
spark-3.3.0-SNAPSHOT-bin-20210915-bbb33af2e4/examples/src/main/python/ml/isotonic_regression_example.py
spark-3.3.0-SNAPSHOT-bin-20210915-bbb33af2e4/examples/src/main/python/ml/onehot_encoder_example.py
spark-3.3.0-SNAPSHOT-bin-20210915-bbb33af2e4/examples/src/main/python/ml/normalizer_example.py
spark-3.3.0-SNAPSHOT-bin-20210915-bbb33af2e4/examples/src/main/python/ml/interaction_example.py
spark-3.3.0-SNAPSHOT-bin-20210915-bbb33af2e4/examples/src/main/python/ml/fm_regressor_example.py
spark-3.3.0-SNAPSHOT-bin-20210915-bbb33af2e4/examples/src/main/python/ml/count_vectorizer_example.py
spark-3.3.0-SNAPSHOT-bin-20210915-bbb33af2e4/examples/src/main/python/ml/multiclass_logistic_regression_with_elastic_net.py
spark-3.3.0-SNAPSHOT-bin-20210915-bbb33af2e4/examples/src/main/python/ml/kmeans_example.py
spark-3.3.0-SNAPSHOT-bin-20210915-bbb33af2e4/examples/src/main/python/ml/gaussian_mixture_example.py
spark-3.3.0-SNAPSHOT-bin-20210915-bbb33af2e4/examples/src/main/python/ml/vector_indexer_example.py
spark-3.3.0-SNAPSHOT-bin-20210915-bbb33af2e4/examples/src/main/python/ml/vector_assembler_example.py
spark-3.3.0-SNAPSHOT-bin-20210915-bbb33af2e4/examples/src/main/python/ml/train_validation_split.py
spark-3.3.0-SNAPSHOT-bin-20210915-bbb33af2e4/examples/src/main/python/ml/generalized_linear_regression_example.py
spark-3.3.0-SNAPSHOT-bin-20210915-bbb33af2e4/examples/src/main/python/ml/univariate_feature_selector_example.py
spark-3.3.0-SNAPSHOT-bin-20210915-bbb33af2e4/examples/src/main/python/ml/pca_example.py
spark-3.3.0-SNAPSHOT-bin-20210915-bbb33af2e4/examples/src/main/python/ml/dataframe_example.py
spark-3.3.0-SNAPSHOT-bin-20210915-bbb33af2e4/examples/src/main/python/ml/bucketizer_example.py
spark-3.3.0-SNAPSHOT-bin-20210915-bbb33af2e4/examples/src/main/python/ml/variance_threshold_selector_example.py
spark-3.3.0-SNAPSHOT-bin-20210915-bbb33af2e4/examples/src/main/python/ml/chisq_selector_example.py
spark-3.3.0-SNAPSHOT-bin-20210915-bbb33af2e4/examples/src/main/python/ml/multilayer_perceptron_classification.py
spark-3.3.0-SNAPSHOT-bin-20210915-bbb33af2e4/examples/src/main/python/ml/bisecting_k_means_example.py
spark-3.3.0-SNAPSHOT-bin-20210915-bbb33af2e4/examples/src/main/python/ml/one_vs_rest_example.py
spark-3.3.0-SNAPSHOT-bin-20210915-bbb33af2e4/examples/src/main/python/ml/min_max_scaler_example.py
spark-3.3.0-SNAPSHOT-bin-20210915-bbb33af2e4/examples/src/main/python/ml/fm_classifier_example.py
spark-3.3.0-SNAPSHOT-bin-20210915-bbb33af2e4/examples/src/main/python/ml/stopwords_remover_example.py
spark-3.3.0-SNAPSHOT-bin-20210915-bbb33af2e4/examples/src/main/python/ml/chi_square_test_example.py
spark-3.3.0-SNAPSHOT-bin-20210915-bbb33af2e4/examples/src/main/python/ml/robust_scaler_example.py
spark-3.3.0-SNAPSHOT-bin-20210915-bbb33af2e4/examples/src/main/python/ml/correlation_example.py
spark-3.3.0-SNAPSHOT-bin-20210915-bbb33af2e4/examples/src/main/python/ml/lda_example.py
spark-3.3.0-SNAPSHOT-bin-20210915-bbb33af2e4/examples/src/main/python/ml/decision_tree_classification_example.py
spark-3.3.0-SNAPSHOT-bin-20210915-bbb33af2e4/examples/src/main/python/ml/pipeline_example.py
spark-3.3.0-SNAPSHOT-bin-20210915-bbb33af2e4/examples/src/main/python/ml/decision_tree_regression_example.py
spark-3.3.0-SNAPSHOT-bin-20210915-bbb33af2e4/examples/src/main/python/ml/min_hash_lsh_example.py
spark-3.3.0-SNAPSHOT-bin-20210915-bbb33af2e4/examples/src/main/python/ml/fpgrowth_example.py
spark-3.3.0-SNAPSHOT-bin-20210915-bbb33af2e4/examples/src/main/python/ml/linearsvc.py
spark-3.3.0-SNAPSHOT-bin-20210915-bbb33af2e4/examples/src/main/python/ml/index_to_string_example.py
spark-3.3.0-SNAPSHOT-bin-20210915-bbb33af2e4/examples/src/main/python/ml/elementwise_product_example.py
spark-3.3.0-SNAPSHOT-bin-20210915-bbb33af2e4/examples/src/main/python/ml/feature_hasher_example.py
spark-3.3.0-SNAPSHOT-bin-20210915-bbb33af2e4/examples/src/main/python/ml/estimator_transformer_param_example.py
spark-3.3.0-SNAPSHOT-bin-20210915-bbb33af2e4/examples/src/main/python/ml/logistic_regression_summary_example.py
spark-3.3.0-SNAPSHOT-bin-20210915-bbb33af2e4/examples/src/main/python/ml/standard_scaler_example.py
spark-3.3.0-SNAPSHOT-bin-20210915-bbb33af2e4/examples/src/main/python/ml/power_iteration_clustering_example.py
spark-3.3.0-SNAPSHOT-bin-20210915-bbb33af2e4/examples/src/main/python/ml/vector_size_hint_example.py
spark-3.3.0-SNAPSHOT-bin-20210915-bbb33af2e4/examples/src/main/python/ml/binarizer_example.py
spark-3.3.0-SNAPSHOT-bin-20210915-bbb33af2e4/examples/src/main/python/ml/polynomial_expansion_example.py
spark-3.3.0-SNAPSHOT-bin-20210915-bbb33af2e4/examples/src/main/python/ml/n_gram_example.py
spark-3.3.0-SNAPSHOT-bin-20210915-bbb33af2e4/examples/src/main/python/ml/random_forest_regressor_example.py
spark-3.3.0-SNAPSHOT-bin-20210915-bbb33af2e4/examples/src/main/python/ml/aft_survival_regression.py
spark-3.3.0-SNAPSHOT-bin-20210915-bbb33af2e4/examples/src/main/python/ml/dct_example.py
spark-3.3.0-SNAPSHOT-bin-20210915-bbb33af2e4/examples/src/main/python/ml/gradient_boosted_tree_regressor_example.py
spark-3.3.0-SNAPSHOT-bin-20210915-bbb33af2e4/examples/src/main/python/ml/string_indexer_example.py
spark-3.3.0-SNAPSHOT-bin-20210915-bbb33af2e4/examples/src/main/python/ml/als_example.py
spark-3.3.0-SNAPSHOT-bin-20210915-bbb33af2e4/examples/src/main/python/ml/vector_slicer_example.py
spark-3.3.0-SNAPSHOT-bin-20210915-bbb33af2e4/examples/src/main/python/streaming/
spark-3.3.0-SNAPSHOT-bin-20210915-bbb33af2e4/examples/src/main/python/streaming/hdfs_wordcount.py
spark-3.3.0-SNAPSHOT-bin-20210915-bbb33af2e4/examples/src/main/python/streaming/recoverable_network_wordcount.py
spark-3.3.0-SNAPSHOT-bin-20210915-bbb33af2e4/examples/src/main/python/streaming/network_wordjoinsentiments.py
spark-3.3.0-SNAPSHOT-bin-20210915-bbb33af2e4/examples/src/main/python/streaming/sql_network_wordcount.py
spark-3.3.0-SNAPSHOT-bin-20210915-bbb33af2e4/examples/src/main/python/streaming/network_wordcount.py
spark-3.3.0-SNAPSHOT-bin-20210915-bbb33af2e4/examples/src/main/python/streaming/queue_stream.py
spark-3.3.0-SNAPSHOT-bin-20210915-bbb33af2e4/examples/src/main/python/streaming/stateful_network_wordcount.py
spark-3.3.0-SNAPSHOT-bin-20210915-bbb33af2e4/examples/src/main/python/wordcount.py
spark-3.3.0-SNAPSHOT-bin-20210915-bbb33af2e4/examples/src/main/python/mllib/
spark-3.3.0-SNAPSHOT-bin-20210915-bbb33af2e4/examples/src/main/python/mllib/latent_dirichlet_allocation_example.py
spark-3.3.0-SNAPSHOT-bin-20210915-bbb33af2e4/examples/src/main/python/mllib/binary_classification_metrics_example.py
spark-3.3.0-SNAPSHOT-bin-20210915-bbb33af2e4/examples/src/main/python/mllib/bisecting_k_means_example.py
spark-3.3.0-SNAPSHOT-bin-20210915-bbb33af2e4/examples/src/main/python/mllib/svm_with_sgd_example.py
spark-3.3.0-SNAPSHOT-bin-20210915-bbb33af2e4/examples/src/main/python/mllib/gaussian_mixture_example.py
spark-3.3.0-SNAPSHOT-bin-20210915-bbb33af2e4/examples/src/main/python/mllib/kmeans.py
spark-3.3.0-SNAPSHOT-bin-20210915-bbb33af2e4/examples/src/main/python/mllib/multi_class_metrics_example.py
spark-3.3.0-SNAPSHOT-bin-20210915-bbb33af2e4/examples/src/main/python/mllib/word2vec_example.py
spark-3.3.0-SNAPSHOT-bin-20210915-bbb33af2e4/examples/src/main/python/mllib/multi_label_metrics_example.py
spark-3.3.0-SNAPSHOT-bin-20210915-bbb33af2e4/examples/src/main/python/mllib/standard_scaler_example.py
spark-3.3.0-SNAPSHOT-bin-20210915-bbb33af2e4/examples/src/main/python/mllib/hypothesis_testing_kolmogorov_smirnov_test_example.py
spark-3.3.0-SNAPSHOT-bin-20210915-bbb33af2e4/examples/src/main/python/mllib/ranking_metrics_example.py
spark-3.3.0-SNAPSHOT-bin-20210915-bbb33af2e4/examples/src/main/python/mllib/random_rdd_generation.py
spark-3.3.0-SNAPSHOT-bin-20210915-bbb33af2e4/examples/src/main/python/mllib/sampled_rdds.py
spark-3.3.0-SNAPSHOT-bin-20210915-bbb33af2e4/examples/src/main/python/mllib/logistic_regression.py
spark-3.3.0-SNAPSHOT-bin-20210915-bbb33af2e4/examples/src/main/python/mllib/gradient_boosting_classification_example.py
spark-3.3.0-SNAPSHOT-bin-20210915-bbb33af2e4/examples/src/main/python/mllib/elementwise_product_example.py
spark-3.3.0-SNAPSHOT-bin-20210915-bbb33af2e4/examples/src/main/python/mllib/decision_tree_classification_example.py
spark-3.3.0-SNAPSHOT-bin-20210915-bbb33af2e4/examples/src/main/python/mllib/hypothesis_testing_example.py
spark-3.3.0-SNAPSHOT-bin-20210915-bbb33af2e4/examples/src/main/python/mllib/streaming_linear_regression_example.py
spark-3.3.0-SNAPSHOT-bin-20210915-bbb33af2e4/examples/src/main/python/mllib/linear_regression_with_sgd_example.py
spark-3.3.0-SNAPSHOT-bin-20210915-bbb33af2e4/examples/src/main/python/mllib/naive_bayes_example.py
spark-3.3.0-SNAPSHOT-bin-20210915-bbb33af2e4/examples/src/main/python/mllib/streaming_k_means_example.py
spark-3.3.0-SNAPSHOT-bin-20210915-bbb33af2e4/examples/src/main/python/mllib/random_forest_regression_example.py
spark-3.3.0-SNAPSHOT-bin-20210915-bbb33af2e4/examples/src/main/python/mllib/gradient_boosting_regression_example.py
spark-3.3.0-SNAPSHOT-bin-20210915-bbb33af2e4/examples/src/main/python/mllib/normalizer_example.py
spark-3.3.0-SNAPSHOT-bin-20210915-bbb33af2e4/examples/src/main/python/mllib/power_iteration_clustering_example.py
spark-3.3.0-SNAPSHOT-bin-20210915-bbb33af2e4/examples/src/main/python/mllib/recommendation_example.py
spark-3.3.0-SNAPSHOT-bin-20210915-bbb33af2e4/examples/src/main/python/mllib/word2vec.py
spark-3.3.0-SNAPSHOT-bin-20210915-bbb33af2e4/examples/src/main/python/mllib/decision_tree_regression_example.py
spark-3.3.0-SNAPSHOT-bin-20210915-bbb33af2e4/examples/src/main/python/mllib/stratified_sampling_example.py
spark-3.3.0-SNAPSHOT-bin-20210915-bbb33af2e4/examples/src/main/python/mllib/kernel_density_estimation_example.py
spark-3.3.0-SNAPSHOT-bin-20210915-bbb33af2e4/examples/src/main/python/mllib/pca_rowmatrix_example.py
spark-3.3.0-SNAPSHOT-bin-20210915-bbb33af2e4/examples/src/main/python/mllib/tf_idf_example.py
spark-3.3.0-SNAPSHOT-bin-20210915-bbb33af2e4/examples/src/main/python/mllib/logistic_regression_with_lbfgs_example.py
spark-3.3.0-SNAPSHOT-bin-20210915-bbb33af2e4/examples/src/main/python/mllib/gaussian_mixture_model.py
spark-3.3.0-SNAPSHOT-bin-20210915-bbb33af2e4/examples/src/main/python/mllib/random_forest_classification_example.py
spark-3.3.0-SNAPSHOT-bin-20210915-bbb33af2e4/examples/src/main/python/mllib/correlations.py
spark-3.3.0-SNAPSHOT-bin-20210915-bbb33af2e4/examples/src/main/python/mllib/correlations_example.py
spark-3.3.0-SNAPSHOT-bin-20210915-bbb33af2e4/examples/src/main/python/mllib/isotonic_regression_example.py
spark-3.3.0-SNAPSHOT-bin-20210915-bbb33af2e4/examples/src/main/python/mllib/regression_metrics_example.py
spark-3.3.0-SNAPSHOT-bin-20210915-bbb33af2e4/examples/src/main/python/mllib/fpgrowth_example.py
spark-3.3.0-SNAPSHOT-bin-20210915-bbb33af2e4/examples/src/main/python/mllib/summary_statistics_example.py
spark-3.3.0-SNAPSHOT-bin-20210915-bbb33af2e4/examples/src/main/python/mllib/k_means_example.py
spark-3.3.0-SNAPSHOT-bin-20210915-bbb33af2e4/examples/src/main/python/mllib/svd_example.py
spark-3.3.0-SNAPSHOT-bin-20210915-bbb33af2e4/examples/src/main/python/transitive_closure.py
spark-3.3.0-SNAPSHOT-bin-20210915-bbb33af2e4/examples/src/main/python/status_api_demo.py
spark-3.3.0-SNAPSHOT-bin-20210915-bbb33af2e4/examples/jars/
spark-3.3.0-SNAPSHOT-bin-20210915-bbb33af2e4/examples/jars/spark-examples_2.12-3.3.0-SNAPSHOT.jar
spark-3.3.0-SNAPSHOT-bin-20210915-bbb33af2e4/examples/jars/scopt_2.12-3.7.1.jar
spark-3.3.0-SNAPSHOT-bin-20210915-bbb33af2e4/sbin/
spark-3.3.0-SNAPSHOT-bin-20210915-bbb33af2e4/sbin/start-all.sh
spark-3.3.0-SNAPSHOT-bin-20210915-bbb33af2e4/sbin/spark-config.sh
spark-3.3.0-SNAPSHOT-bin-20210915-bbb33af2e4/sbin/start-mesos-shuffle-service.sh
spark-3.3.0-SNAPSHOT-bin-20210915-bbb33af2e4/sbin/stop-master.sh
spark-3.3.0-SNAPSHOT-bin-20210915-bbb33af2e4/sbin/decommission-worker.sh
spark-3.3.0-SNAPSHOT-bin-20210915-bbb33af2e4/sbin/slaves.sh
spark-3.3.0-SNAPSHOT-bin-20210915-bbb33af2e4/sbin/start-master.sh
spark-3.3.0-SNAPSHOT-bin-20210915-bbb33af2e4/sbin/spark-daemons.sh
spark-3.3.0-SNAPSHOT-bin-20210915-bbb33af2e4/sbin/stop-thriftserver.sh
spark-3.3.0-SNAPSHOT-bin-20210915-bbb33af2e4/sbin/stop-history-server.sh
spark-3.3.0-SNAPSHOT-bin-20210915-bbb33af2e4/sbin/stop-mesos-dispatcher.sh
spark-3.3.0-SNAPSHOT-bin-20210915-bbb33af2e4/sbin/stop-all.sh
spark-3.3.0-SNAPSHOT-bin-20210915-bbb33af2e4/sbin/start-slaves.sh
spark-3.3.0-SNAPSHOT-bin-20210915-bbb33af2e4/sbin/spark-daemon.sh
spark-3.3.0-SNAPSHOT-bin-20210915-bbb33af2e4/sbin/start-slave.sh
spark-3.3.0-SNAPSHOT-bin-20210915-bbb33af2e4/sbin/stop-slave.sh
spark-3.3.0-SNAPSHOT-bin-20210915-bbb33af2e4/sbin/start-thriftserver.sh
spark-3.3.0-SNAPSHOT-bin-20210915-bbb33af2e4/sbin/start-worker.sh
spark-3.3.0-SNAPSHOT-bin-20210915-bbb33af2e4/sbin/start-mesos-dispatcher.sh
spark-3.3.0-SNAPSHOT-bin-20210915-bbb33af2e4/sbin/start-workers.sh
spark-3.3.0-SNAPSHOT-bin-20210915-bbb33af2e4/sbin/workers.sh
spark-3.3.0-SNAPSHOT-bin-20210915-bbb33af2e4/sbin/decommission-slave.sh
spark-3.3.0-SNAPSHOT-bin-20210915-bbb33af2e4/sbin/stop-workers.sh
spark-3.3.0-SNAPSHOT-bin-20210915-bbb33af2e4/sbin/start-history-server.sh
spark-3.3.0-SNAPSHOT-bin-20210915-bbb33af2e4/sbin/stop-worker.sh
spark-3.3.0-SNAPSHOT-bin-20210915-bbb33af2e4/sbin/stop-mesos-shuffle-service.sh
spark-3.3.0-SNAPSHOT-bin-20210915-bbb33af2e4/sbin/stop-slaves.sh
spark-3.3.0-SNAPSHOT-bin-20210915-bbb33af2e4/jars/
spark-3.3.0-SNAPSHOT-bin-20210915-bbb33af2e4/jars/arpack_combined_all-0.1.jar
spark-3.3.0-SNAPSHOT-bin-20210915-bbb33af2e4/jars/jackson-module-scala_2.12-2.12.5.jar
spark-3.3.0-SNAPSHOT-bin-20210915-bbb33af2e4/jars/jsr305-3.0.0.jar
spark-3.3.0-SNAPSHOT-bin-20210915-bbb33af2e4/jars/hive-shims-0.23-2.3.9.jar
spark-3.3.0-SNAPSHOT-bin-20210915-bbb33af2e4/jars/RoaringBitmap-0.9.0.jar
spark-3.3.0-SNAPSHOT-bin-20210915-bbb33af2e4/jars/hive-storage-api-2.7.2.jar
spark-3.3.0-SNAPSHOT-bin-20210915-bbb33af2e4/jars/jackson-datatype-jsr310-2.11.2.jar
spark-3.3.0-SNAPSHOT-bin-20210915-bbb33af2e4/jars/jline-2.14.6.jar
spark-3.3.0-SNAPSHOT-bin-20210915-bbb33af2e4/jars/antlr-runtime-3.5.2.jar
spark-3.3.0-SNAPSHOT-bin-20210915-bbb33af2e4/jars/spark-mllib_2.12-3.3.0-SNAPSHOT.jar
spark-3.3.0-SNAPSHOT-bin-20210915-bbb33af2e4/jars/jodd-core-3.5.2.jar
spark-3.3.0-SNAPSHOT-bin-20210915-bbb33af2e4/jars/paranamer-2.8.jar
spark-3.3.0-SNAPSHOT-bin-20210915-bbb33af2e4/jars/commons-logging-1.1.3.jar
spark-3.3.0-SNAPSHOT-bin-20210915-bbb33af2e4/jars/jcl-over-slf4j-1.7.30.jar
spark-3.3.0-SNAPSHOT-bin-20210915-bbb33af2e4/jars/aopalliance-repackaged-2.6.1.jar
spark-3.3.0-SNAPSHOT-bin-20210915-bbb33af2e4/jars/hive-vector-code-gen-2.3.9.jar
spark-3.3.0-SNAPSHOT-bin-20210915-bbb33af2e4/jars/osgi-resource-locator-1.0.3.jar
spark-3.3.0-SNAPSHOT-bin-20210915-bbb33af2e4/jars/hk2-utils-2.6.1.jar
spark-3.3.0-SNAPSHOT-bin-20210915-bbb33af2e4/jars/metrics-jvm-4.2.2.jar
spark-3.3.0-SNAPSHOT-bin-20210915-bbb33af2e4/jars/hadoop-client-api-3.3.1.jar
spark-3.3.0-SNAPSHOT-bin-20210915-bbb33af2e4/jars/orc-core-1.6.10.jar
spark-3.3.0-SNAPSHOT-bin-20210915-bbb33af2e4/jars/spark-streaming_2.12-3.3.0-SNAPSHOT.jar
spark-3.3.0-SNAPSHOT-bin-20210915-bbb33af2e4/jars/opencsv-2.3.jar
spark-3.3.0-SNAPSHOT-bin-20210915-bbb33af2e4/jars/spire-macros_2.12-0.17.0.jar
spark-3.3.0-SNAPSHOT-bin-20210915-bbb33af2e4/jars/jersey-container-servlet-2.34.jar
spark-3.3.0-SNAPSHOT-bin-20210915-bbb33af2e4/jars/generex-1.0.2.jar
spark-3.3.0-SNAPSHOT-bin-20210915-bbb33af2e4/jars/okio-1.14.0.jar
spark-3.3.0-SNAPSHOT-bin-20210915-bbb33af2e4/jars/gson-2.2.4.jar
spark-3.3.0-SNAPSHOT-bin-20210915-bbb33af2e4/jars/joda-time-2.10.10.jar
spark-3.3.0-SNAPSHOT-bin-20210915-bbb33af2e4/jars/spark-repl_2.12-3.3.0-SNAPSHOT.jar
spark-3.3.0-SNAPSHOT-bin-20210915-bbb33af2e4/jars/commons-dbcp-1.4.jar
spark-3.3.0-SNAPSHOT-bin-20210915-bbb33af2e4/jars/jackson-databind-2.12.5.jar
spark-3.3.0-SNAPSHOT-bin-20210915-bbb33af2e4/jars/hive-shims-common-2.3.9.jar
spark-3.3.0-SNAPSHOT-bin-20210915-bbb33af2e4/jars/jul-to-slf4j-1.7.30.jar
spark-3.3.0-SNAPSHOT-bin-20210915-bbb33af2e4/jars/kubernetes-model-admissionregistration-5.6.0.jar
spark-3.3.0-SNAPSHOT-bin-20210915-bbb33af2e4/jars/scala-parser-combinators_2.12-1.1.2.jar
spark-3.3.0-SNAPSHOT-bin-20210915-bbb33af2e4/jars/snappy-java-1.1.8.4.jar
spark-3.3.0-SNAPSHOT-bin-20210915-bbb33af2e4/jars/spark-launcher_2.12-3.3.0-SNAPSHOT.jar
spark-3.3.0-SNAPSHOT-bin-20210915-bbb33af2e4/jars/jakarta.inject-2.6.1.jar
spark-3.3.0-SNAPSHOT-bin-20210915-bbb33af2e4/jars/shapeless_2.12-2.3.3.jar
spark-3.3.0-SNAPSHOT-bin-20210915-bbb33af2e4/jars/json-1.8.jar
spark-3.3.0-SNAPSHOT-bin-20210915-bbb33af2e4/jars/javolution-5.5.1.jar
spark-3.3.0-SNAPSHOT-bin-20210915-bbb33af2e4/jars/snakeyaml-1.27.jar
spark-3.3.0-SNAPSHOT-bin-20210915-bbb33af2e4/jars/istack-commons-runtime-3.0.8.jar
spark-3.3.0-SNAPSHOT-bin-20210915-bbb33af2e4/jars/activation-1.1.1.jar
spark-3.3.0-SNAPSHOT-bin-20210915-bbb33af2e4/jars/JTransforms-3.1.jar
spark-3.3.0-SNAPSHOT-bin-20210915-bbb33af2e4/jars/slf4j-api-1.7.30.jar
spark-3.3.0-SNAPSHOT-bin-20210915-bbb33af2e4/jars/velocity-1.5.jar
spark-3.3.0-SNAPSHOT-bin-20210915-bbb33af2e4/jars/curator-framework-2.13.0.jar
spark-3.3.0-SNAPSHOT-bin-20210915-bbb33af2e4/jars/curator-recipes-2.13.0.jar
spark-3.3.0-SNAPSHOT-bin-20210915-bbb33af2e4/jars/datanucleus-rdbms-4.1.19.jar
spark-3.3.0-SNAPSHOT-bin-20210915-bbb33af2e4/jars/janino-3.0.16.jar
spark-3.3.0-SNAPSHOT-bin-20210915-bbb33af2e4/jars/jackson-core-2.12.5.jar
spark-3.3.0-SNAPSHOT-bin-20210915-bbb33af2e4/jars/guava-14.0.1.jar
spark-3.3.0-SNAPSHOT-bin-20210915-bbb33af2e4/jars/spark-catalyst_2.12-3.3.0-SNAPSHOT.jar
spark-3.3.0-SNAPSHOT-bin-20210915-bbb33af2e4/jars/commons-net-3.1.jar
spark-3.3.0-SNAPSHOT-bin-20210915-bbb33af2e4/jars/scala-collection-compat_2.12-2.1.1.jar
spark-3.3.0-SNAPSHOT-bin-20210915-bbb33af2e4/jars/commons-pool-1.5.4.jar
spark-3.3.0-SNAPSHOT-bin-20210915-bbb33af2e4/jars/kubernetes-model-rbac-5.6.0.jar
spark-3.3.0-SNAPSHOT-bin-20210915-bbb33af2e4/jars/ivy-2.5.0.jar
spark-3.3.0-SNAPSHOT-bin-20210915-bbb33af2e4/jars/kubernetes-model-discovery-5.6.0.jar
spark-3.3.0-SNAPSHOT-bin-20210915-bbb33af2e4/jars/kubernetes-client-5.6.0.jar
spark-3.3.0-SNAPSHOT-bin-20210915-bbb33af2e4/jars/javassist-3.25.0-GA.jar
spark-3.3.0-SNAPSHOT-bin-20210915-bbb33af2e4/jars/lz4-java-1.8.0.jar
spark-3.3.0-SNAPSHOT-bin-20210915-bbb33af2e4/jars/commons-codec-1.15.jar
spark-3.3.0-SNAPSHOT-bin-20210915-bbb33af2e4/jars/netty-all-4.1.68.Final.jar
spark-3.3.0-SNAPSHOT-bin-20210915-bbb33af2e4/jars/commons-io-2.11.0.jar
spark-3.3.0-SNAPSHOT-bin-20210915-bbb33af2e4/jars/spire_2.12-0.17.0.jar
spark-3.3.0-SNAPSHOT-bin-20210915-bbb33af2e4/jars/hive-shims-scheduler-2.3.9.jar
spark-3.3.0-SNAPSHOT-bin-20210915-bbb33af2e4/jars/avro-ipc-1.10.2.jar
spark-3.3.0-SNAPSHOT-bin-20210915-bbb33af2e4/jars/orc-shims-1.6.10.jar
spark-3.3.0-SNAPSHOT-bin-20210915-bbb33af2e4/jars/kubernetes-model-certificates-5.6.0.jar
spark-3.3.0-SNAPSHOT-bin-20210915-bbb33af2e4/jars/json4s-scalap_2.12-3.7.0-M11.jar
spark-3.3.0-SNAPSHOT-bin-20210915-bbb33af2e4/jars/derby-10.14.2.0.jar
spark-3.3.0-SNAPSHOT-bin-20210915-bbb33af2e4/jars/zstd-jni-1.5.0-4.jar
spark-3.3.0-SNAPSHOT-bin-20210915-bbb33af2e4/jars/pyrolite-4.30.jar
spark-3.3.0-SNAPSHOT-bin-20210915-bbb33af2e4/jars/arrow-memory-core-2.0.0.jar
spark-3.3.0-SNAPSHOT-bin-20210915-bbb33af2e4/jars/univocity-parsers-2.9.1.jar
spark-3.3.0-SNAPSHOT-bin-20210915-bbb33af2e4/jars/arrow-memory-netty-2.0.0.jar
spark-3.3.0-SNAPSHOT-bin-20210915-bbb33af2e4/jars/stax-api-1.0.1.jar
spark-3.3.0-SNAPSHOT-bin-20210915-bbb33af2e4/jars/libthrift-0.12.0.jar
spark-3.3.0-SNAPSHOT-bin-20210915-bbb33af2e4/jars/hadoop-client-runtime-3.3.1.jar
spark-3.3.0-SNAPSHOT-bin-20210915-bbb33af2e4/jars/hive-common-2.3.9.jar
spark-3.3.0-SNAPSHOT-bin-20210915-bbb33af2e4/jars/jdo-api-3.0.1.jar
spark-3.3.0-SNAPSHOT-bin-20210915-bbb33af2e4/jars/spark-kubernetes_2.12-3.3.0-SNAPSHOT.jar
spark-3.3.0-SNAPSHOT-bin-20210915-bbb33af2e4/jars/commons-lang-2.6.jar
spark-3.3.0-SNAPSHOT-bin-20210915-bbb33af2e4/jars/datanucleus-api-jdo-4.2.4.jar
spark-3.3.0-SNAPSHOT-bin-20210915-bbb33af2e4/jars/kubernetes-model-extensions-5.6.0.jar
spark-3.3.0-SNAPSHOT-bin-20210915-bbb33af2e4/jars/metrics-jmx-4.2.2.jar
spark-3.3.0-SNAPSHOT-bin-20210915-bbb33af2e4/jars/spark-hive-thriftserver_2.12-3.3.0-SNAPSHOT.jar
spark-3.3.0-SNAPSHOT-bin-20210915-bbb33af2e4/jars/ST4-4.0.4.jar
spark-3.3.0-SNAPSHOT-bin-20210915-bbb33af2e4/jars/scala-library-2.12.15.jar
spark-3.3.0-SNAPSHOT-bin-20210915-bbb33af2e4/jars/kryo-shaded-4.0.2.jar
spark-3.3.0-SNAPSHOT-bin-20210915-bbb33af2e4/jars/logging-interceptor-3.12.12.jar
spark-3.3.0-SNAPSHOT-bin-20210915-bbb33af2e4/jars/jackson-dataformat-yaml-2.12.5.jar
spark-3.3.0-SNAPSHOT-bin-20210915-bbb33af2e4/jars/spark-tags_2.12-3.3.0-SNAPSHOT-tests.jar
spark-3.3.0-SNAPSHOT-bin-20210915-bbb33af2e4/jars/jakarta.annotation-api-1.3.5.jar
spark-3.3.0-SNAPSHOT-bin-20210915-bbb33af2e4/jars/parquet-format-structures-1.12.1.jar
spark-3.3.0-SNAPSHOT-bin-20210915-bbb33af2e4/jars/avro-mapred-1.10.2.jar
spark-3.3.0-SNAPSHOT-bin-20210915-bbb33af2e4/jars/parquet-jackson-1.12.1.jar
spark-3.3.0-SNAPSHOT-bin-20210915-bbb33af2e4/jars/lapack-2.2.0.jar
spark-3.3.0-SNAPSHOT-bin-20210915-bbb33af2e4/jars/json4s-jackson_2.12-3.7.0-M11.jar
spark-3.3.0-SNAPSHOT-bin-20210915-bbb33af2e4/jars/commons-compiler-3.0.16.jar
spark-3.3.0-SNAPSHOT-bin-20210915-bbb33af2e4/jars/zjsonpatch-0.3.0.jar
spark-3.3.0-SNAPSHOT-bin-20210915-bbb33af2e4/jars/jersey-hk2-2.34.jar
spark-3.3.0-SNAPSHOT-bin-20210915-bbb33af2e4/jars/jta-1.1.jar
spark-3.3.0-SNAPSHOT-bin-20210915-bbb33af2e4/jars/json4s-core_2.12-3.7.0-M11.jar
spark-3.3.0-SNAPSHOT-bin-20210915-bbb33af2e4/jars/algebra_2.12-2.0.1.jar
spark-3.3.0-SNAPSHOT-bin-20210915-bbb33af2e4/jars/flatbuffers-java-1.9.0.jar
spark-3.3.0-SNAPSHOT-bin-20210915-bbb33af2e4/jars/parquet-hadoop-1.12.1.jar
spark-3.3.0-SNAPSHOT-bin-20210915-bbb33af2e4/jars/log4j-1.2.17.jar
spark-3.3.0-SNAPSHOT-bin-20210915-bbb33af2e4/jars/chill_2.12-0.10.0.jar
spark-3.3.0-SNAPSHOT-bin-20210915-bbb33af2e4/jars/orc-mapreduce-1.6.10.jar
spark-3.3.0-SNAPSHOT-bin-20210915-bbb33af2e4/jars/xbean-asm9-shaded-4.20.jar
spark-3.3.0-SNAPSHOT-bin-20210915-bbb33af2e4/jars/oro-2.0.8.jar
spark-3.3.0-SNAPSHOT-bin-20210915-bbb33af2e4/jars/spark-graphx_2.12-3.3.0-SNAPSHOT.jar
spark-3.3.0-SNAPSHOT-bin-20210915-bbb33af2e4/jars/parquet-column-1.12.1.jar
spark-3.3.0-SNAPSHOT-bin-20210915-bbb33af2e4/jars/hive-service-rpc-3.1.2.jar
spark-3.3.0-SNAPSHOT-bin-20210915-bbb33af2e4/jars/datanucleus-core-4.1.17.jar
spark-3.3.0-SNAPSHOT-bin-20210915-bbb33af2e4/jars/spark-network-common_2.12-3.3.0-SNAPSHOT.jar
spark-3.3.0-SNAPSHOT-bin-20210915-bbb33af2e4/jars/kubernetes-model-networking-5.6.0.jar
spark-3.3.0-SNAPSHOT-bin-20210915-bbb33af2e4/jars/arrow-format-2.0.0.jar
spark-3.3.0-SNAPSHOT-bin-20210915-bbb33af2e4/jars/spark-hive_2.12-3.3.0-SNAPSHOT.jar
spark-3.3.0-SNAPSHOT-bin-20210915-bbb33af2e4/jars/cats-kernel_2.12-2.1.1.jar
spark-3.3.0-SNAPSHOT-bin-20210915-bbb33af2e4/jars/spark-sql_2.12-3.3.0-SNAPSHOT.jar
spark-3.3.0-SNAPSHOT-bin-20210915-bbb33af2e4/jars/macro-compat_2.12-1.1.1.jar
spark-3.3.0-SNAPSHOT-bin-20210915-bbb33af2e4/jars/kubernetes-model-flowcontrol-5.6.0.jar
spark-3.3.0-SNAPSHOT-bin-20210915-bbb33af2e4/jars/kubernetes-model-batch-5.6.0.jar
spark-3.3.0-SNAPSHOT-bin-20210915-bbb33af2e4/jars/curator-client-2.13.0.jar
spark-3.3.0-SNAPSHOT-bin-20210915-bbb33af2e4/jars/bonecp-0.8.0.RELEASE.jar
spark-3.3.0-SNAPSHOT-bin-20210915-bbb33af2e4/jars/super-csv-2.2.0.jar
spark-3.3.0-SNAPSHOT-bin-20210915-bbb33af2e4/jars/kubernetes-model-apps-5.6.0.jar
spark-3.3.0-SNAPSHOT-bin-20210915-bbb33af2e4/jars/hk2-locator-2.6.1.jar
spark-3.3.0-SNAPSHOT-bin-20210915-bbb33af2e4/jars/javax.jdo-3.2.0-m3.jar
spark-3.3.0-SNAPSHOT-bin-20210915-bbb33af2e4/jars/jersey-container-servlet-core-2.34.jar
spark-3.3.0-SNAPSHOT-bin-20210915-bbb33af2e4/jars/HikariCP-2.5.1.jar
spark-3.3.0-SNAPSHOT-bin-20210915-bbb33af2e4/jars/antlr4-runtime-4.8.jar
spark-3.3.0-SNAPSHOT-bin-20210915-bbb33af2e4/jars/parquet-encoding-1.12.1.jar
spark-3.3.0-SNAPSHOT-bin-20210915-bbb33af2e4/jars/metrics-json-4.2.2.jar
spark-3.3.0-SNAPSHOT-bin-20210915-bbb33af2e4/jars/hive-beeline-2.3.9.jar
spark-3.3.0-SNAPSHOT-bin-20210915-bbb33af2e4/jars/spark-mllib-local_2.12-3.3.0-SNAPSHOT.jar
spark-3.3.0-SNAPSHOT-bin-20210915-bbb33af2e4/jars/kubernetes-model-events-5.6.0.jar
spark-3.3.0-SNAPSHOT-bin-20210915-bbb33af2e4/jars/commons-collections-3.2.2.jar
spark-3.3.0-SNAPSHOT-bin-20210915-bbb33af2e4/jars/arrow-vector-2.0.0.jar
spark-3.3.0-SNAPSHOT-bin-20210915-bbb33af2e4/jars/aircompressor-0.21.jar
spark-3.3.0-SNAPSHOT-bin-20210915-bbb33af2e4/jars/json4s-ast_2.12-3.7.0-M11.jar
spark-3.3.0-SNAPSHOT-bin-20210915-bbb33af2e4/jars/metrics-core-4.2.2.jar
spark-3.3.0-SNAPSHOT-bin-20210915-bbb33af2e4/jars/annotations-17.0.0.jar
spark-3.3.0-SNAPSHOT-bin-20210915-bbb33af2e4/jars/kubernetes-model-policy-5.6.0.jar
spark-3.3.0-SNAPSHOT-bin-20210915-bbb33af2e4/jars/commons-compress-1.21.jar
spark-3.3.0-SNAPSHOT-bin-20210915-bbb33af2e4/jars/chill-java-0.10.0.jar
spark-3.3.0-SNAPSHOT-bin-20210915-bbb33af2e4/jars/spark-unsafe_2.12-3.3.0-SNAPSHOT.jar
spark-3.3.0-SNAPSHOT-bin-20210915-bbb33af2e4/jars/spire-platform_2.12-0.17.0.jar
spark-3.3.0-SNAPSHOT-bin-20210915-bbb33af2e4/jars/jakarta.xml.bind-api-2.3.2.jar
spark-3.3.0-SNAPSHOT-bin-20210915-bbb33af2e4/jars/rocksdbjni-6.20.3.jar
spark-3.3.0-SNAPSHOT-bin-20210915-bbb33af2e4/jars/dropwizard-metrics-hadoop-metrics2-reporter-0.1.2.jar
spark-3.3.0-SNAPSHOT-bin-20210915-bbb33af2e4/jars/kubernetes-model-autoscaling-5.6.0.jar
spark-3.3.0-SNAPSHOT-bin-20210915-bbb33af2e4/jars/leveldbjni-all-1.8.jar
spark-3.3.0-SNAPSHOT-bin-20210915-bbb33af2e4/jars/hive-cli-2.3.9.jar
spark-3.3.0-SNAPSHOT-bin-20210915-bbb33af2e4/jars/jaxb-api-2.2.11.jar
spark-3.3.0-SNAPSHOT-bin-20210915-bbb33af2e4/jars/spark-kvstore_2.12-3.3.0-SNAPSHOT.jar
spark-3.3.0-SNAPSHOT-bin-20210915-bbb33af2e4/jars/threeten-extra-1.5.0.jar
spark-3.3.0-SNAPSHOT-bin-20210915-bbb33af2e4/jars/kubernetes-model-core-5.6.0.jar
spark-3.3.0-SNAPSHOT-bin-20210915-bbb33af2e4/jars/hive-llap-common-2.3.9.jar
spark-3.3.0-SNAPSHOT-bin-20210915-bbb33af2e4/jars/spire-util_2.12-0.17.0.jar
spark-3.3.0-SNAPSHOT-bin-20210915-bbb33af2e4/jars/stream-2.9.6.jar
spark-3.3.0-SNAPSHOT-bin-20210915-bbb33af2e4/jars/kubernetes-model-storageclass-5.6.0.jar
spark-3.3.0-SNAPSHOT-bin-20210915-bbb33af2e4/jars/xz-1.8.jar
spark-3.3.0-SNAPSHOT-bin-20210915-bbb33af2e4/jars/slf4j-log4j12-1.7.30.jar
spark-3.3.0-SNAPSHOT-bin-20210915-bbb33af2e4/jars/minlog-1.3.0.jar
spark-3.3.0-SNAPSHOT-bin-20210915-bbb33af2e4/jars/commons-crypto-1.1.0.jar
spark-3.3.0-SNAPSHOT-bin-20210915-bbb33af2e4/jars/jaxb-runtime-2.3.2.jar
spark-3.3.0-SNAPSHOT-bin-20210915-bbb33af2e4/jars/httpclient-4.5.13.jar
spark-3.3.0-SNAPSHOT-bin-20210915-bbb33af2e4/jars/blas-2.2.0.jar
spark-3.3.0-SNAPSHOT-bin-20210915-bbb33af2e4/jars/zookeeper-3.6.2.jar
spark-3.3.0-SNAPSHOT-bin-20210915-bbb33af2e4/jars/shims-0.9.0.jar
spark-3.3.0-SNAPSHOT-bin-20210915-bbb33af2e4/jars/tink-1.6.0.jar
spark-3.3.0-SNAPSHOT-bin-20210915-bbb33af2e4/jars/okhttp-3.12.12.jar
spark-3.3.0-SNAPSHOT-bin-20210915-bbb33af2e4/jars/audience-annotations-0.5.0.jar
spark-3.3.0-SNAPSHOT-bin-20210915-bbb33af2e4/jars/breeze_2.12-1.2.jar
spark-3.3.0-SNAPSHOT-bin-20210915-bbb33af2e4/jars/jpam-1.1.jar
spark-3.3.0-SNAPSHOT-bin-20210915-bbb33af2e4/jars/kubernetes-model-scheduling-5.6.0.jar
spark-3.3.0-SNAPSHOT-bin-20210915-bbb33af2e4/jars/hive-exec-2.3.9-core.jar
spark-3.3.0-SNAPSHOT-bin-20210915-bbb33af2e4/jars/jackson-annotations-2.12.5.jar
spark-3.3.0-SNAPSHOT-bin-20210915-bbb33af2e4/jars/jersey-client-2.34.jar
spark-3.3.0-SNAPSHOT-bin-20210915-bbb33af2e4/jars/hive-metastore-2.3.9.jar
spark-3.3.0-SNAPSHOT-bin-20210915-bbb33af2e4/jars/jakarta.ws.rs-api-2.1.6.jar
spark-3.3.0-SNAPSHOT-bin-20210915-bbb33af2e4/jars/objenesis-2.6.jar
spark-3.3.0-SNAPSHOT-bin-20210915-bbb33af2e4/jars/hive-jdbc-2.3.9.jar
spark-3.3.0-SNAPSHOT-bin-20210915-bbb33af2e4/jars/jakarta.validation-api-2.0.2.jar
spark-3.3.0-SNAPSHOT-bin-20210915-bbb33af2e4/jars/commons-text-1.6.jar
spark-3.3.0-SNAPSHOT-bin-20210915-bbb33af2e4/jars/jakarta.servlet-api-4.0.3.jar
spark-3.3.0-SNAPSHOT-bin-20210915-bbb33af2e4/jars/htrace-core4-4.1.0-incubating.jar
spark-3.3.0-SNAPSHOT-bin-20210915-bbb33af2e4/jars/compress-lzf-1.0.3.jar
spark-3.3.0-SNAPSHOT-bin-20210915-bbb33af2e4/jars/hive-serde-2.3.9.jar
spark-3.3.0-SNAPSHOT-bin-20210915-bbb33af2e4/jars/spark-network-shuffle_2.12-3.3.0-SNAPSHOT.jar
spark-3.3.0-SNAPSHOT-bin-20210915-bbb33af2e4/jars/commons-math3-3.4.1.jar
spark-3.3.0-SNAPSHOT-bin-20210915-bbb33af2e4/jars/commons-lang3-3.12.0.jar
spark-3.3.0-SNAPSHOT-bin-20210915-bbb33af2e4/jars/core-1.1.2.jar
spark-3.3.0-SNAPSHOT-bin-20210915-bbb33af2e4/jars/JLargeArrays-1.5.jar
spark-3.3.0-SNAPSHOT-bin-20210915-bbb33af2e4/jars/arpack-2.2.0.jar
spark-3.3.0-SNAPSHOT-bin-20210915-bbb33af2e4/jars/kubernetes-model-node-5.6.0.jar
spark-3.3.0-SNAPSHOT-bin-20210915-bbb33af2e4/jars/spark-sketch_2.12-3.3.0-SNAPSHOT.jar
spark-3.3.0-SNAPSHOT-bin-20210915-bbb33af2e4/jars/scala-compiler-2.12.15.jar
spark-3.3.0-SNAPSHOT-bin-20210915-bbb33af2e4/jars/spark-core_2.12-3.3.0-SNAPSHOT.jar
spark-3.3.0-SNAPSHOT-bin-20210915-bbb33af2e4/jars/kubernetes-model-coordination-5.6.0.jar
spark-3.3.0-SNAPSHOT-bin-20210915-bbb33af2e4/jars/httpcore-4.4.14.jar
spark-3.3.0-SNAPSHOT-bin-20210915-bbb33af2e4/jars/jackson-core-asl-1.9.13.jar
spark-3.3.0-SNAPSHOT-bin-20210915-bbb33af2e4/jars/kubernetes-model-apiextensions-5.6.0.jar
spark-3.3.0-SNAPSHOT-bin-20210915-bbb33af2e4/jars/libfb303-0.9.3.jar
spark-3.3.0-SNAPSHOT-bin-20210915-bbb33af2e4/jars/avro-1.10.2.jar
spark-3.3.0-SNAPSHOT-bin-20210915-bbb33af2e4/jars/jersey-common-2.34.jar
spark-3.3.0-SNAPSHOT-bin-20210915-bbb33af2e4/jars/kubernetes-model-common-5.6.0.jar
spark-3.3.0-SNAPSHOT-bin-20210915-bbb33af2e4/jars/scala-xml_2.12-1.2.0.jar
spark-3.3.0-SNAPSHOT-bin-20210915-bbb33af2e4/jars/spark-tags_2.12-3.3.0-SNAPSHOT.jar
spark-3.3.0-SNAPSHOT-bin-20210915-bbb33af2e4/jars/parquet-common-1.12.1.jar
spark-3.3.0-SNAPSHOT-bin-20210915-bbb33af2e4/jars/commons-cli-1.2.jar
spark-3.3.0-SNAPSHOT-bin-20210915-bbb33af2e4/jars/hive-shims-2.3.9.jar
spark-3.3.0-SNAPSHOT-bin-20210915-bbb33af2e4/jars/jersey-server-2.34.jar
spark-3.3.0-SNAPSHOT-bin-20210915-bbb33af2e4/jars/jackson-mapper-asl-1.9.13.jar
spark-3.3.0-SNAPSHOT-bin-20210915-bbb33af2e4/jars/breeze-macros_2.12-1.2.jar
spark-3.3.0-SNAPSHOT-bin-20210915-bbb33af2e4/jars/kubernetes-model-metrics-5.6.0.jar
spark-3.3.0-SNAPSHOT-bin-20210915-bbb33af2e4/jars/scala-reflect-2.12.15.jar
spark-3.3.0-SNAPSHOT-bin-20210915-bbb33af2e4/jars/metrics-graphite-4.2.2.jar
spark-3.3.0-SNAPSHOT-bin-20210915-bbb33af2e4/jars/protobuf-java-2.5.0.jar
spark-3.3.0-SNAPSHOT-bin-20210915-bbb33af2e4/jars/py4j-0.10.9.2.jar
spark-3.3.0-SNAPSHOT-bin-20210915-bbb33af2e4/jars/hk2-api-2.6.1.jar
spark-3.3.0-SNAPSHOT-bin-20210915-bbb33af2e4/jars/transaction-api-1.1.jar
spark-3.3.0-SNAPSHOT-bin-20210915-bbb33af2e4/jars/automaton-1.11-8.jar
spark-3.3.0-SNAPSHOT-bin-20210915-bbb33af2e4/jars/zookeeper-jute-3.6.2.jar
spark-3.3.0-SNAPSHOT-bin-20210915-bbb33af2e4/NOTICE
spark-3.3.0-SNAPSHOT-bin-20210915-bbb33af2e4/bin/
spark-3.3.0-SNAPSHOT-bin-20210915-bbb33af2e4/bin/pyspark2.cmd
spark-3.3.0-SNAPSHOT-bin-20210915-bbb33af2e4/bin/sparkR.cmd
spark-3.3.0-SNAPSHOT-bin-20210915-bbb33af2e4/bin/pyspark
spark-3.3.0-SNAPSHOT-bin-20210915-bbb33af2e4/bin/docker-image-tool.sh
spark-3.3.0-SNAPSHOT-bin-20210915-bbb33af2e4/bin/spark-sql2.cmd
spark-3.3.0-SNAPSHOT-bin-20210915-bbb33af2e4/bin/spark-submit2.cmd
spark-3.3.0-SNAPSHOT-bin-20210915-bbb33af2e4/bin/spark-submit.cmd
spark-3.3.0-SNAPSHOT-bin-20210915-bbb33af2e4/bin/spark-shell.cmd
spark-3.3.0-SNAPSHOT-bin-20210915-bbb33af2e4/bin/load-spark-env.cmd
spark-3.3.0-SNAPSHOT-bin-20210915-bbb33af2e4/bin/spark-class
spark-3.3.0-SNAPSHOT-bin-20210915-bbb33af2e4/bin/spark-submit
spark-3.3.0-SNAPSHOT-bin-20210915-bbb33af2e4/bin/beeline
spark-3.3.0-SNAPSHOT-bin-20210915-bbb33af2e4/bin/run-example.cmd
spark-3.3.0-SNAPSHOT-bin-20210915-bbb33af2e4/bin/spark-sql
spark-3.3.0-SNAPSHOT-bin-20210915-bbb33af2e4/bin/load-spark-env.sh
spark-3.3.0-SNAPSHOT-bin-20210915-bbb33af2e4/bin/sparkR
spark-3.3.0-SNAPSHOT-bin-20210915-bbb33af2e4/bin/spark-shell2.cmd
spark-3.3.0-SNAPSHOT-bin-20210915-bbb33af2e4/bin/pyspark.cmd
spark-3.3.0-SNAPSHOT-bin-20210915-bbb33af2e4/bin/spark-class.cmd
spark-3.3.0-SNAPSHOT-bin-20210915-bbb33af2e4/bin/spark-class2.cmd
spark-3.3.0-SNAPSHOT-bin-20210915-bbb33af2e4/bin/spark-shell
spark-3.3.0-SNAPSHOT-bin-20210915-bbb33af2e4/bin/spark-sql.cmd
spark-3.3.0-SNAPSHOT-bin-20210915-bbb33af2e4/bin/find-spark-home.cmd
spark-3.3.0-SNAPSHOT-bin-20210915-bbb33af2e4/bin/beeline.cmd
spark-3.3.0-SNAPSHOT-bin-20210915-bbb33af2e4/bin/sparkR2.cmd
spark-3.3.0-SNAPSHOT-bin-20210915-bbb33af2e4/bin/find-spark-home
spark-3.3.0-SNAPSHOT-bin-20210915-bbb33af2e4/bin/run-example
spark-3.3.0-SNAPSHOT-bin-20210915-bbb33af2e4/LICENSE
spark-3.3.0-SNAPSHOT-bin-20210915-bbb33af2e4/README.md
spark-3.3.0-SNAPSHOT-bin-20210915-bbb33af2e4/licenses/
spark-3.3.0-SNAPSHOT-bin-20210915-bbb33af2e4/licenses/LICENSE-jline.txt
spark-3.3.0-SNAPSHOT-bin-20210915-bbb33af2e4/licenses/LICENSE-CC0.txt
spark-3.3.0-SNAPSHOT-bin-20210915-bbb33af2e4/licenses/LICENSE-dagre-d3.txt
spark-3.3.0-SNAPSHOT-bin-20210915-bbb33af2e4/licenses/LICENSE-f2j.txt
spark-3.3.0-SNAPSHOT-bin-20210915-bbb33af2e4/licenses/LICENSE-blas.txt
spark-3.3.0-SNAPSHOT-bin-20210915-bbb33af2e4/licenses/LICENSE-modernizr.txt
spark-3.3.0-SNAPSHOT-bin-20210915-bbb33af2e4/licenses/LICENSE-bootstrap.txt
spark-3.3.0-SNAPSHOT-bin-20210915-bbb33af2e4/licenses/LICENSE-respond.txt
spark-3.3.0-SNAPSHOT-bin-20210915-bbb33af2e4/licenses/LICENSE-slf4j.txt
spark-3.3.0-SNAPSHOT-bin-20210915-bbb33af2e4/licenses/LICENSE-d3.min.js.txt
spark-3.3.0-SNAPSHOT-bin-20210915-bbb33af2e4/licenses/LICENSE-protobuf.txt
spark-3.3.0-SNAPSHOT-bin-20210915-bbb33af2e4/licenses/LICENSE-jodd.txt
spark-3.3.0-SNAPSHOT-bin-20210915-bbb33af2e4/licenses/LICENSE-javax-transaction-transaction-api.txt
spark-3.3.0-SNAPSHOT-bin-20210915-bbb33af2e4/licenses/LICENSE-AnchorJS.txt
spark-3.3.0-SNAPSHOT-bin-20210915-bbb33af2e4/licenses/LICENSE-minlog.txt
spark-3.3.0-SNAPSHOT-bin-20210915-bbb33af2e4/licenses/LICENSE-zstd.txt
spark-3.3.0-SNAPSHOT-bin-20210915-bbb33af2e4/licenses/LICENSE-antlr.txt
spark-3.3.0-SNAPSHOT-bin-20210915-bbb33af2e4/licenses/LICENSE-machinist.txt
spark-3.3.0-SNAPSHOT-bin-20210915-bbb33af2e4/licenses/LICENSE-graphlib-dot.txt
spark-3.3.0-SNAPSHOT-bin-20210915-bbb33af2e4/licenses/LICENSE-zstd-jni.txt
spark-3.3.0-SNAPSHOT-bin-20210915-bbb33af2e4/licenses/LICENSE-javassist.html
spark-3.3.0-SNAPSHOT-bin-20210915-bbb33af2e4/licenses/LICENSE-vis-timeline.txt
spark-3.3.0-SNAPSHOT-bin-20210915-bbb33af2e4/licenses/LICENSE-jakarta.activation-api.txt
spark-3.3.0-SNAPSHOT-bin-20210915-bbb33af2e4/licenses/LICENSE-sbt-launch-lib.txt
spark-3.3.0-SNAPSHOT-bin-20210915-bbb33af2e4/licenses/LICENSE-javolution.txt
spark-3.3.0-SNAPSHOT-bin-20210915-bbb33af2e4/licenses/LICENSE-spire.txt
spark-3.3.0-SNAPSHOT-bin-20210915-bbb33af2e4/licenses/LICENSE-jakarta.xml.bind-api.txt
spark-3.3.0-SNAPSHOT-bin-20210915-bbb33af2e4/licenses/LICENSE-join.txt
spark-3.3.0-SNAPSHOT-bin-20210915-bbb33af2e4/licenses/LICENSE-xmlenc.txt
spark-3.3.0-SNAPSHOT-bin-20210915-bbb33af2e4/licenses/LICENSE-re2j.txt
spark-3.3.0-SNAPSHOT-bin-20210915-bbb33af2e4/licenses/LICENSE-cloudpickle.txt
spark-3.3.0-SNAPSHOT-bin-20210915-bbb33af2e4/licenses/LICENSE-paranamer.txt
spark-3.3.0-SNAPSHOT-bin-20210915-bbb33af2e4/licenses/LICENSE-pyrolite.txt
spark-3.3.0-SNAPSHOT-bin-20210915-bbb33af2e4/licenses/LICENSE-jakarta-ws-rs-api
spark-3.3.0-SNAPSHOT-bin-20210915-bbb33af2e4/licenses/LICENSE-JTransforms.txt
spark-3.3.0-SNAPSHOT-bin-20210915-bbb33af2e4/licenses/LICENSE-jquery.txt
spark-3.3.0-SNAPSHOT-bin-20210915-bbb33af2e4/licenses/LICENSE-jakarta-annotation-api
spark-3.3.0-SNAPSHOT-bin-20210915-bbb33af2e4/licenses/LICENSE-json-formatter.txt
spark-3.3.0-SNAPSHOT-bin-20210915-bbb33af2e4/licenses/LICENSE-mustache.txt
spark-3.3.0-SNAPSHOT-bin-20210915-bbb33af2e4/licenses/LICENSE-datatables.txt
spark-3.3.0-SNAPSHOT-bin-20210915-bbb33af2e4/licenses/LICENSE-JLargeArrays.txt
spark-3.3.0-SNAPSHOT-bin-20210915-bbb33af2e4/licenses/LICENSE-dnsjava.txt
spark-3.3.0-SNAPSHOT-bin-20210915-bbb33af2e4/licenses/LICENSE-netlib.txt
spark-3.3.0-SNAPSHOT-bin-20210915-bbb33af2e4/licenses/LICENSE-matchMedia-polyfill.txt
spark-3.3.0-SNAPSHOT-bin-20210915-bbb33af2e4/licenses/LICENSE-reflectasm.txt
spark-3.3.0-SNAPSHOT-bin-20210915-bbb33af2e4/licenses/LICENSE-scopt.txt
spark-3.3.0-SNAPSHOT-bin-20210915-bbb33af2e4/licenses/LICENSE-jsp-api.txt
spark-3.3.0-SNAPSHOT-bin-20210915-bbb33af2e4/licenses/LICENSE-jaxb-runtime.txt
spark-3.3.0-SNAPSHOT-bin-20210915-bbb33af2e4/licenses/LICENSE-scala.txt
spark-3.3.0-SNAPSHOT-bin-20210915-bbb33af2e4/licenses/LICENSE-arpack.txt
spark-3.3.0-SNAPSHOT-bin-20210915-bbb33af2e4/licenses/LICENSE-istack-commons-runtime.txt
spark-3.3.0-SNAPSHOT-bin-20210915-bbb33af2e4/licenses/LICENSE-kryo.txt
spark-3.3.0-SNAPSHOT-bin-20210915-bbb33af2e4/licenses/LICENSE-automaton.txt
spark-3.3.0-SNAPSHOT-bin-20210915-bbb33af2e4/licenses/LICENSE-leveldbjni.txt
spark-3.3.0-SNAPSHOT-bin-20210915-bbb33af2e4/licenses/LICENSE-pmml-model.txt
spark-3.3.0-SNAPSHOT-bin-20210915-bbb33af2e4/licenses/LICENSE-janino.txt
spark-3.3.0-SNAPSHOT-bin-20210915-bbb33af2e4/licenses/LICENSE-sorttable.js.txt
spark-3.3.0-SNAPSHOT-bin-20210915-bbb33af2e4/licenses/LICENSE-py4j.txt
spark-3.3.0-SNAPSHOT-bin-20210915-bbb33af2e4/R/
spark-3.3.0-SNAPSHOT-bin-20210915-bbb33af2e4/R/lib/
spark-3.3.0-SNAPSHOT-bin-20210915-bbb33af2e4/R/lib/sparkr.zip
spark-3.3.0-SNAPSHOT-bin-20210915-bbb33af2e4/R/lib/SparkR/
spark-3.3.0-SNAPSHOT-bin-20210915-bbb33af2e4/R/lib/SparkR/profile/
spark-3.3.0-SNAPSHOT-bin-20210915-bbb33af2e4/R/lib/SparkR/profile/shell.R
spark-3.3.0-SNAPSHOT-bin-20210915-bbb33af2e4/R/lib/SparkR/profile/general.R
spark-3.3.0-SNAPSHOT-bin-20210915-bbb33af2e4/R/lib/SparkR/DESCRIPTION
spark-3.3.0-SNAPSHOT-bin-20210915-bbb33af2e4/R/lib/SparkR/html/
spark-3.3.0-SNAPSHOT-bin-20210915-bbb33af2e4/R/lib/SparkR/html/00Index.html
spark-3.3.0-SNAPSHOT-bin-20210915-bbb33af2e4/R/lib/SparkR/html/R.css
spark-3.3.0-SNAPSHOT-bin-20210915-bbb33af2e4/R/lib/SparkR/INDEX
spark-3.3.0-SNAPSHOT-bin-20210915-bbb33af2e4/R/lib/SparkR/worker/
spark-3.3.0-SNAPSHOT-bin-20210915-bbb33af2e4/R/lib/SparkR/worker/daemon.R
spark-3.3.0-SNAPSHOT-bin-20210915-bbb33af2e4/R/lib/SparkR/worker/worker.R
spark-3.3.0-SNAPSHOT-bin-20210915-bbb33af2e4/R/lib/SparkR/help/
spark-3.3.0-SNAPSHOT-bin-20210915-bbb33af2e4/R/lib/SparkR/help/paths.rds
spark-3.3.0-SNAPSHOT-bin-20210915-bbb33af2e4/R/lib/SparkR/help/AnIndex
spark-3.3.0-SNAPSHOT-bin-20210915-bbb33af2e4/R/lib/SparkR/help/aliases.rds
spark-3.3.0-SNAPSHOT-bin-20210915-bbb33af2e4/R/lib/SparkR/help/SparkR.rdb
spark-3.3.0-SNAPSHOT-bin-20210915-bbb33af2e4/R/lib/SparkR/help/SparkR.rdx
spark-3.3.0-SNAPSHOT-bin-20210915-bbb33af2e4/R/lib/SparkR/Meta/
spark-3.3.0-SNAPSHOT-bin-20210915-bbb33af2e4/R/lib/SparkR/Meta/package.rds
spark-3.3.0-SNAPSHOT-bin-20210915-bbb33af2e4/R/lib/SparkR/Meta/features.rds
spark-3.3.0-SNAPSHOT-bin-20210915-bbb33af2e4/R/lib/SparkR/Meta/hsearch.rds
spark-3.3.0-SNAPSHOT-bin-20210915-bbb33af2e4/R/lib/SparkR/Meta/links.rds
spark-3.3.0-SNAPSHOT-bin-20210915-bbb33af2e4/R/lib/SparkR/Meta/vignette.rds
spark-3.3.0-SNAPSHOT-bin-20210915-bbb33af2e4/R/lib/SparkR/Meta/Rd.rds
spark-3.3.0-SNAPSHOT-bin-20210915-bbb33af2e4/R/lib/SparkR/Meta/nsInfo.rds
spark-3.3.0-SNAPSHOT-bin-20210915-bbb33af2e4/R/lib/SparkR/doc/
spark-3.3.0-SNAPSHOT-bin-20210915-bbb33af2e4/R/lib/SparkR/doc/index.html
spark-3.3.0-SNAPSHOT-bin-20210915-bbb33af2e4/R/lib/SparkR/doc/sparkr-vignettes.Rmd
spark-3.3.0-SNAPSHOT-bin-20210915-bbb33af2e4/R/lib/SparkR/doc/sparkr-vignettes.R
spark-3.3.0-SNAPSHOT-bin-20210915-bbb33af2e4/R/lib/SparkR/doc/sparkr-vignettes.html
spark-3.3.0-SNAPSHOT-bin-20210915-bbb33af2e4/R/lib/SparkR/tests/
spark-3.3.0-SNAPSHOT-bin-20210915-bbb33af2e4/R/lib/SparkR/tests/testthat/
spark-3.3.0-SNAPSHOT-bin-20210915-bbb33af2e4/R/lib/SparkR/tests/testthat/test_basic.R
spark-3.3.0-SNAPSHOT-bin-20210915-bbb33af2e4/R/lib/SparkR/NAMESPACE
spark-3.3.0-SNAPSHOT-bin-20210915-bbb33af2e4/R/lib/SparkR/R/
spark-3.3.0-SNAPSHOT-bin-20210915-bbb33af2e4/R/lib/SparkR/R/SparkR
spark-3.3.0-SNAPSHOT-bin-20210915-bbb33af2e4/R/lib/SparkR/R/SparkR.rdb
spark-3.3.0-SNAPSHOT-bin-20210915-bbb33af2e4/R/lib/SparkR/R/SparkR.rdx
spark-3.3.0-SNAPSHOT-bin-20210915-bbb33af2e4/kubernetes/
spark-3.3.0-SNAPSHOT-bin-20210915-bbb33af2e4/kubernetes/tests/
spark-3.3.0-SNAPSHOT-bin-20210915-bbb33af2e4/kubernetes/tests/decommissioning_cleanup.py
spark-3.3.0-SNAPSHOT-bin-20210915-bbb33af2e4/kubernetes/tests/autoscale.py
spark-3.3.0-SNAPSHOT-bin-20210915-bbb33af2e4/kubernetes/tests/python_executable_check.py
spark-3.3.0-SNAPSHOT-bin-20210915-bbb33af2e4/kubernetes/tests/worker_memory_check.py
spark-3.3.0-SNAPSHOT-bin-20210915-bbb33af2e4/kubernetes/tests/py_container_checks.py
spark-3.3.0-SNAPSHOT-bin-20210915-bbb33af2e4/kubernetes/tests/pyfiles.py
spark-3.3.0-SNAPSHOT-bin-20210915-bbb33af2e4/kubernetes/tests/decommissioning.py
spark-3.3.0-SNAPSHOT-bin-20210915-bbb33af2e4/kubernetes/dockerfiles/
spark-3.3.0-SNAPSHOT-bin-20210915-bbb33af2e4/kubernetes/dockerfiles/spark/
spark-3.3.0-SNAPSHOT-bin-20210915-bbb33af2e4/kubernetes/dockerfiles/spark/decom.sh
spark-3.3.0-SNAPSHOT-bin-20210915-bbb33af2e4/kubernetes/dockerfiles/spark/bindings/
spark-3.3.0-SNAPSHOT-bin-20210915-bbb33af2e4/kubernetes/dockerfiles/spark/bindings/R/
spark-3.3.0-SNAPSHOT-bin-20210915-bbb33af2e4/kubernetes/dockerfiles/spark/bindings/R/Dockerfile
spark-3.3.0-SNAPSHOT-bin-20210915-bbb33af2e4/kubernetes/dockerfiles/spark/bindings/python/
spark-3.3.0-SNAPSHOT-bin-20210915-bbb33af2e4/kubernetes/dockerfiles/spark/bindings/python/Dockerfile
spark-3.3.0-SNAPSHOT-bin-20210915-bbb33af2e4/kubernetes/dockerfiles/spark/Dockerfile
spark-3.3.0-SNAPSHOT-bin-20210915-bbb33af2e4/kubernetes/dockerfiles/spark/entrypoint.sh
+ SPARK_INPUT_DIR=/home/jenkins/workspace/spark-master-test-k8s/resource-managers/kubernetes/integration-tests/target/spark-dist-unpacked
+ DOCKER_FILE_BASE_PATH=/home/jenkins/workspace/spark-master-test-k8s/resource-managers/kubernetes/integration-tests/target/spark-dist-unpacked/kubernetes/dockerfiles/spark
+ [[ N/A == \N\/\A ]]
++ /home/jenkins/workspace/spark-master-test-k8s/build/mvn help:evaluate -Dexpression=project.version
++ grep -v INFO
++ grep -v WARNING
++ tail -n 1
Using `mvn` from path: /home/jenkins/tools/hudson.tasks.Maven_MavenInstallation/Maven_3.6.3/bin/mvn
+ VERSION=3.3.0-SNAPSHOT
++ uuidgen
+ IMAGE_TAG=3.3.0-SNAPSHOT_999240c1-7b37-46ab-b0af-b9a4be5a22d2
+ cd /home/jenkins/workspace/spark-master-test-k8s/resource-managers/kubernetes/integration-tests/target/spark-dist-unpacked
+ JAVA_IMAGE_TAG_BUILD_ARG='-b java_image_tag=8-jre-slim'
+ LANGUAGE_BINDING_BUILD_ARGS='-p /home/jenkins/workspace/spark-master-test-k8s/resource-managers/kubernetes/integration-tests/target/spark-dist-unpacked/kubernetes/dockerfiles/spark/bindings/python/Dockerfile'
+ tags=(${EXCLUDE_TAGS//,/ })
+ [[ ! "" =~ r ]]
+ LANGUAGE_BINDING_BUILD_ARGS='-p /home/jenkins/workspace/spark-master-test-k8s/resource-managers/kubernetes/integration-tests/target/spark-dist-unpacked/kubernetes/dockerfiles/spark/bindings/python/Dockerfile -R /home/jenkins/workspace/spark-master-test-k8s/resource-managers/kubernetes/integration-tests/target/spark-dist-unpacked/kubernetes/dockerfiles/spark/bindings/R/Dockerfile'
+ unset SPARK_HOME
+ case $DEPLOY_MODE in
+ /home/jenkins/workspace/spark-master-test-k8s/resource-managers/kubernetes/integration-tests/target/spark-dist-unpacked/bin/docker-image-tool.sh -m -r docker.io/kubespark -t 3.3.0-SNAPSHOT_999240c1-7b37-46ab-b0af-b9a4be5a22d2 -b java_image_tag=8-jre-slim -p /home/jenkins/workspace/spark-master-test-k8s/resource-managers/kubernetes/integration-tests/target/spark-dist-unpacked/kubernetes/dockerfiles/spark/bindings/python/Dockerfile -R /home/jenkins/workspace/spark-master-test-k8s/resource-managers/kubernetes/integration-tests/target/spark-dist-unpacked/kubernetes/dockerfiles/spark/bindings/R/Dockerfile build
Sending build context to Docker daemon  314.6MB

Step 1/18 : ARG java_image_tag=11-jre-slim
Step 2/18 : FROM openjdk:${java_image_tag}
 ---> ce66e5466c92
Step 3/18 : ARG spark_uid=185
 ---> Using cache
 ---> 7516629df8f8
Step 4/18 : RUN set -ex &&     sed -i 's/http:\/\/deb.\(.*\)/https:\/\/deb.\1/g' /etc/apt/sources.list &&     apt-get update &&     ln -s /lib /lib64 &&     apt install -y bash tini libc6 libpam-modules krb5-user libnss3 procps &&     mkdir -p /opt/spark &&     mkdir -p /opt/spark/examples &&     mkdir -p /opt/spark/work-dir &&     touch /opt/spark/RELEASE &&     rm /bin/sh &&     ln -sv /bin/bash /bin/sh &&     echo "auth required pam_wheel.so use_uid" >> /etc/pam.d/su &&     chgrp root /etc/passwd && chmod ug+rw /etc/passwd &&     rm -rf /var/cache/apt/*
 ---> Using cache
 ---> 7284c3aab629
Step 5/18 : COPY jars /opt/spark/jars
 ---> 49da3a539a34
Step 6/18 : COPY bin /opt/spark/bin
 ---> 003ac4653574
Step 7/18 : COPY sbin /opt/spark/sbin
 ---> 948ae62b2685
Step 8/18 : COPY kubernetes/dockerfiles/spark/entrypoint.sh /opt/
 ---> f81431b7bfc2
Step 9/18 : COPY kubernetes/dockerfiles/spark/decom.sh /opt/
 ---> 399e74102610
Step 10/18 : COPY examples /opt/spark/examples
 ---> 38ec55107c13
Step 11/18 : COPY kubernetes/tests /opt/spark/tests
 ---> a352ba29b48b
Step 12/18 : COPY data /opt/spark/data
 ---> dceaca9fc948
Step 13/18 : ENV SPARK_HOME /opt/spark
 ---> Running in 64becddabff5
Removing intermediate container 64becddabff5
 ---> 778127ec6f7a
Step 14/18 : WORKDIR /opt/spark/work-dir
 ---> Running in c5ec74a63c3b
Removing intermediate container c5ec74a63c3b
 ---> ab542831797d
Step 15/18 : RUN chmod g+w /opt/spark/work-dir
 ---> Running in 013df30a8d68
Removing intermediate container 013df30a8d68
 ---> a9ef3c106edf
Step 16/18 : RUN chmod a+x /opt/decom.sh
 ---> Running in 4f7d002f38ef
Removing intermediate container 4f7d002f38ef
 ---> 139caf3eab24
Step 17/18 : ENTRYPOINT [ "/opt/entrypoint.sh" ]
 ---> Running in e0c2cbff2cc0
Removing intermediate container e0c2cbff2cc0
 ---> 79bf378cce2a
Step 18/18 : USER ${spark_uid}
 ---> Running in 4b7cab525db7
Removing intermediate container 4b7cab525db7
 ---> 7d5d3c295b09
Successfully built 7d5d3c295b09
Successfully tagged kubespark/spark:3.3.0-SNAPSHOT_999240c1-7b37-46ab-b0af-b9a4be5a22d2
Sending build context to Docker daemon  314.6MB

Step 1/12 : ARG base_img
Step 2/12 : FROM $base_img
 ---> 7d5d3c295b09
Step 3/12 : WORKDIR /
 ---> Running in 0eff2cdc9838
Removing intermediate container 0eff2cdc9838
 ---> 181449539c4c
Step 4/12 : USER 0
 ---> Running in dc42f9322012
Removing intermediate container dc42f9322012
 ---> 68107827c8b8
Step 5/12 : RUN mkdir ${SPARK_HOME}/python
 ---> Running in 3edb2230bbc7
Removing intermediate container 3edb2230bbc7
 ---> f6f9a7c4fc60
Step 6/12 : RUN apt-get update &&     apt install -y python3 python3-pip &&     pip3 install --upgrade pip setuptools &&     rm -r /root/.cache && rm -rf /var/cache/apt/*
 ---> Running in 8087a8236f68
Hit:1 https://deb.debian.org/debian bullseye InRelease
Hit:2 http://security.debian.org/debian-security bullseye-security InRelease
Hit:3 https://deb.debian.org/debian bullseye-updates InRelease
Reading package lists...

WARNING: apt does not have a stable CLI interface. Use with caution in scripts.

Reading package lists...
Building dependency tree...
Reading state information...
The following additional packages will be installed:
  binutils binutils-common binutils-x86-64-linux-gnu build-essential bzip2 cpp
  cpp-10 dirmngr dpkg-dev fakeroot fontconfig-config fonts-dejavu-core g++
  g++-10 gcc gcc-10 gnupg gnupg-l10n gnupg-utils gpg gpg-agent gpg-wks-client
  gpg-wks-server gpgconf gpgsm javascript-common libalgorithm-diff-perl
  libalgorithm-diff-xs-perl libalgorithm-merge-perl libasan6 libassuan0
  libatomic1 libbinutils libbrotli1 libbsd0 libc-dev-bin libc-devtools
  libc6-dev libcc1-0 libcrypt-dev libctf-nobfd0 libctf0 libdeflate0
  libdpkg-perl libexpat1 libexpat1-dev libfakeroot libfile-fcntllock-perl
  libfontconfig1 libfreetype6 libgcc-10-dev libgd3 libgdbm-compat4 libgdbm6
  libgomp1 libisl23 libitm1 libjbig0 libjpeg62-turbo libjs-jquery
  libjs-sphinxdoc libjs-underscore libksba8 libldap-2.4-2 libldap-common
  liblocale-gettext-perl liblsan0 libmd0 libmpc3 libmpdec3 libmpfr6 libnpth0
  libnsl-dev libperl5.32 libpng16-16 libpython3-dev libpython3-stdlib
  libpython3.9 libpython3.9-dev libpython3.9-minimal libpython3.9-stdlib
  libquadmath0 libreadline8 libsasl2-2 libsasl2-modules libsasl2-modules-db
  libstdc++-10-dev libtiff5 libtirpc-dev libtsan0 libubsan1 libwebp6 libx11-6
  libx11-data libxau6 libxcb1 libxdmcp6 libxpm4 linux-libc-dev make manpages
  manpages-dev media-types netbase patch perl perl-modules-5.32
  pinentry-curses python-pip-whl python3-dev python3-distutils python3-lib2to3
  python3-minimal python3-pkg-resources python3-setuptools python3-wheel
  python3.9 python3.9-dev python3.9-minimal readline-common sensible-utils ucf
  xz-utils zlib1g-dev
Suggested packages:
  binutils-doc bzip2-doc cpp-doc gcc-10-locales dbus-user-session
  libpam-systemd pinentry-gnome3 tor debian-keyring g++-multilib
  g++-10-multilib gcc-10-doc gcc-multilib autoconf automake libtool flex bison
  gdb gcc-doc gcc-10-multilib parcimonie xloadimage scdaemon apache2
  | lighttpd | httpd glibc-doc git bzr libgd-tools gdbm-l10n
  libsasl2-modules-gssapi-mit | libsasl2-modules-gssapi-heimdal
  libsasl2-modules-ldap libsasl2-modules-otp libsasl2-modules-sql
  libstdc++-10-doc make-doc man-browser ed diffutils-doc perl-doc
  libterm-readline-gnu-perl | libterm-readline-perl-perl
  libtap-harness-archive-perl pinentry-doc python3-doc python3-tk python3-venv
  python-setuptools-doc python3.9-venv python3.9-doc binfmt-support
  readline-doc
The following NEW packages will be installed:
  binutils binutils-common binutils-x86-64-linux-gnu build-essential bzip2 cpp
  cpp-10 dirmngr dpkg-dev fakeroot fontconfig-config fonts-dejavu-core g++
  g++-10 gcc gcc-10 gnupg gnupg-l10n gnupg-utils gpg gpg-agent gpg-wks-client
  gpg-wks-server gpgconf gpgsm javascript-common libalgorithm-diff-perl
  libalgorithm-diff-xs-perl libalgorithm-merge-perl libasan6 libassuan0
  libatomic1 libbinutils libbrotli1 libbsd0 libc-dev-bin libc-devtools
  libc6-dev libcc1-0 libcrypt-dev libctf-nobfd0 libctf0 libdeflate0
  libdpkg-perl libexpat1 libexpat1-dev libfakeroot libfile-fcntllock-perl
  libfontconfig1 libfreetype6 libgcc-10-dev libgd3 libgdbm-compat4 libgdbm6
  libgomp1 libisl23 libitm1 libjbig0 libjpeg62-turbo libjs-jquery
  libjs-sphinxdoc libjs-underscore libksba8 libldap-2.4-2 libldap-common
  liblocale-gettext-perl liblsan0 libmd0 libmpc3 libmpdec3 libmpfr6 libnpth0
  libnsl-dev libperl5.32 libpng16-16 libpython3-dev libpython3-stdlib
  libpython3.9 libpython3.9-dev libpython3.9-minimal libpython3.9-stdlib
  libquadmath0 libreadline8 libsasl2-2 libsasl2-modules libsasl2-modules-db
  libstdc++-10-dev libtiff5 libtirpc-dev libtsan0 libubsan1 libwebp6 libx11-6
  libx11-data libxau6 libxcb1 libxdmcp6 libxpm4 linux-libc-dev make manpages
  manpages-dev media-types netbase patch perl perl-modules-5.32
  pinentry-curses python-pip-whl python3 python3-dev python3-distutils
  python3-lib2to3 python3-minimal python3-pip python3-pkg-resources
  python3-setuptools python3-wheel python3.9 python3.9-dev python3.9-minimal
  readline-common sensible-utils ucf xz-utils zlib1g-dev
0 upgraded, 126 newly installed, 0 to remove and 0 not upgraded.
Need to get 102 MB of archives.
After this operation, 369 MB of additional disk space will be used.
Get:1 http://security.debian.org/debian-security bullseye-security/main amd64 perl-modules-5.32 all 5.32.1-4+deb11u1 [2823 kB]
Get:2 https://deb.debian.org/debian bullseye/main amd64 libgdbm6 amd64 1.19-2 [64.9 kB]
Get:3 http://security.debian.org/debian-security bullseye-security/main amd64 libperl5.32 amd64 5.32.1-4+deb11u1 [4098 kB]
Get:4 http://security.debian.org/debian-security bullseye-security/main amd64 perl amd64 5.32.1-4+deb11u1 [293 kB]
Get:5 https://deb.debian.org/debian bullseye/main amd64 libgdbm-compat4 amd64 1.19-2 [44.7 kB]
Get:6 https://deb.debian.org/debian bullseye/main amd64 liblocale-gettext-perl amd64 1.07-4+b1 [19.0 kB]
Get:7 https://deb.debian.org/debian bullseye/main amd64 libpython3.9-minimal amd64 3.9.2-1 [801 kB]
Get:8 https://deb.debian.org/debian bullseye/main amd64 libexpat1 amd64 2.2.10-2 [96.9 kB]
Get:9 https://deb.debian.org/debian bullseye/main amd64 python3.9-minimal amd64 3.9.2-1 [1955 kB]
Get:10 https://deb.debian.org/debian bullseye/main amd64 python3-minimal amd64 3.9.2-3 [38.2 kB]
Get:11 https://deb.debian.org/debian bullseye/main amd64 media-types all 4.0.0 [30.3 kB]
Get:12 https://deb.debian.org/debian bullseye/main amd64 libmpdec3 amd64 2.5.1-1 [87.7 kB]
Get:13 https://deb.debian.org/debian bullseye/main amd64 readline-common all 8.1-1 [73.7 kB]
Get:14 https://deb.debian.org/debian bullseye/main amd64 libreadline8 amd64 8.1-1 [169 kB]
Get:15 https://deb.debian.org/debian bullseye/main amd64 libpython3.9-stdlib amd64 3.9.2-1 [1684 kB]
Get:16 https://deb.debian.org/debian bullseye/main amd64 python3.9 amd64 3.9.2-1 [466 kB]
Get:17 https://deb.debian.org/debian bullseye/main amd64 libpython3-stdlib amd64 3.9.2-3 [21.4 kB]
Get:18 https://deb.debian.org/debian bullseye/main amd64 python3 amd64 3.9.2-3 [37.9 kB]
Get:19 https://deb.debian.org/debian bullseye/main amd64 netbase all 6.3 [19.9 kB]
Get:20 https://deb.debian.org/debian bullseye/main amd64 sensible-utils all 0.0.14 [14.8 kB]
Get:21 https://deb.debian.org/debian bullseye/main amd64 bzip2 amd64 1.0.8-4 [49.3 kB]
Get:22 https://deb.debian.org/debian bullseye/main amd64 manpages all 5.10-1 [1412 kB]
Get:23 https://deb.debian.org/debian bullseye/main amd64 ucf all 3.0043 [74.0 kB]
Get:24 https://deb.debian.org/debian bullseye/main amd64 xz-utils amd64 5.2.5-2 [220 kB]
Get:25 https://deb.debian.org/debian bullseye/main amd64 binutils-common amd64 2.35.2-2 [2220 kB]
Get:26 https://deb.debian.org/debian bullseye/main amd64 libbinutils amd64 2.35.2-2 [570 kB]
Get:27 https://deb.debian.org/debian bullseye/main amd64 libctf-nobfd0 amd64 2.35.2-2 [110 kB]
Get:28 https://deb.debian.org/debian bullseye/main amd64 libctf0 amd64 2.35.2-2 [53.2 kB]
Get:29 https://deb.debian.org/debian bullseye/main amd64 binutils-x86-64-linux-gnu amd64 2.35.2-2 [1809 kB]
Get:30 https://deb.debian.org/debian bullseye/main amd64 binutils amd64 2.35.2-2 [61.2 kB]
Get:31 https://deb.debian.org/debian bullseye/main amd64 libc-dev-bin amd64 2.31-13 [275 kB]
Get:32 https://deb.debian.org/debian bullseye/main amd64 linux-libc-dev amd64 5.10.46-4 [1362 kB]
Get:33 https://deb.debian.org/debian bullseye/main amd64 libcrypt-dev amd64 1:4.4.18-4 [104 kB]
Get:34 https://deb.debian.org/debian bullseye/main amd64 libtirpc-dev amd64 1.3.1-1 [190 kB]
Get:35 https://deb.debian.org/debian bullseye/main amd64 libnsl-dev amd64 1.3.0-2 [66.4 kB]
Get:36 https://deb.debian.org/debian bullseye/main amd64 libc6-dev amd64 2.31-13 [2344 kB]
Get:37 https://deb.debian.org/debian bullseye/main amd64 libisl23 amd64 0.23-1 [676 kB]
Get:38 https://deb.debian.org/debian bullseye/main amd64 libmpfr6 amd64 4.1.0-3 [2012 kB]
Get:39 https://deb.debian.org/debian bullseye/main amd64 libmpc3 amd64 1.2.0-1 [45.0 kB]
Get:40 https://deb.debian.org/debian bullseye/main amd64 cpp-10 amd64 10.2.1-6 [8528 kB]
Get:41 https://deb.debian.org/debian bullseye/main amd64 cpp amd64 4:10.2.1-1 [19.7 kB]
Get:42 https://deb.debian.org/debian bullseye/main amd64 libcc1-0 amd64 10.2.1-6 [47.0 kB]
Get:43 https://deb.debian.org/debian bullseye/main amd64 libgomp1 amd64 10.2.1-6 [99.9 kB]
Get:44 https://deb.debian.org/debian bullseye/main amd64 libitm1 amd64 10.2.1-6 [25.8 kB]
Get:45 https://deb.debian.org/debian bullseye/main amd64 libatomic1 amd64 10.2.1-6 [9008 B]
Get:46 https://deb.debian.org/debian bullseye/main amd64 libasan6 amd64 10.2.1-6 [2065 kB]
Get:47 https://deb.debian.org/debian bullseye/main amd64 liblsan0 amd64 10.2.1-6 [828 kB]
Get:48 https://deb.debian.org/debian bullseye/main amd64 libtsan0 amd64 10.2.1-6 [2000 kB]
Get:49 https://deb.debian.org/debian bullseye/main amd64 libubsan1 amd64 10.2.1-6 [777 kB]
Get:50 https://deb.debian.org/debian bullseye/main amd64 libquadmath0 amd64 10.2.1-6 [145 kB]
Get:51 https://deb.debian.org/debian bullseye/main amd64 libgcc-10-dev amd64 10.2.1-6 [2328 kB]
Get:52 https://deb.debian.org/debian bullseye/main amd64 gcc-10 amd64 10.2.1-6 [17.0 MB]
Get:53 https://deb.debian.org/debian bullseye/main amd64 gcc amd64 4:10.2.1-1 [5192 B]
Get:54 https://deb.debian.org/debian bullseye/main amd64 libstdc++-10-dev amd64 10.2.1-6 [1741 kB]
Get:55 https://deb.debian.org/debian bullseye/main amd64 g++-10 amd64 10.2.1-6 [9380 kB]
Get:56 https://deb.debian.org/debian bullseye/main amd64 g++ amd64 4:10.2.1-1 [1644 B]
Get:57 https://deb.debian.org/debian bullseye/main amd64 make amd64 4.3-4.1 [396 kB]
Get:58 https://deb.debian.org/debian bullseye/main amd64 libdpkg-perl all 1.20.9 [1537 kB]
Get:59 https://deb.debian.org/debian bullseye/main amd64 patch amd64 2.7.6-7 [128 kB]
Get:60 https://deb.debian.org/debian bullseye/main amd64 dpkg-dev all 1.20.9 [2153 kB]
Get:61 https://deb.debian.org/debian bullseye/main amd64 build-essential amd64 12.9 [7704 B]
Get:62 https://deb.debian.org/debian bullseye/main amd64 libassuan0 amd64 2.5.3-7.1 [50.5 kB]
Get:63 https://deb.debian.org/debian bullseye/main amd64 gpgconf amd64 2.2.27-2 [547 kB]
Get:64 https://deb.debian.org/debian bullseye/main amd64 libksba8 amd64 1.5.0-3 [123 kB]
Get:65 https://deb.debian.org/debian bullseye/main amd64 libsasl2-modules-db amd64 2.1.27+dfsg-2.1 [69.1 kB]
Get:66 https://deb.debian.org/debian bullseye/main amd64 libsasl2-2 amd64 2.1.27+dfsg-2.1 [106 kB]
Get:67 https://deb.debian.org/debian bullseye/main amd64 libldap-2.4-2 amd64 2.4.57+dfsg-3 [232 kB]
Get:68 https://deb.debian.org/debian bullseye/main amd64 libnpth0 amd64 1.6-3 [19.0 kB]
Get:69 https://deb.debian.org/debian bullseye/main amd64 dirmngr amd64 2.2.27-2 [762 kB]
Get:70 https://deb.debian.org/debian bullseye/main amd64 libfakeroot amd64 1.25.3-1.1 [47.0 kB]
Get:71 https://deb.debian.org/debian bullseye/main amd64 fakeroot amd64 1.25.3-1.1 [87.0 kB]
Get:72 https://deb.debian.org/debian bullseye/main amd64 fonts-dejavu-core all 2.37-2 [1069 kB]
Get:73 https://deb.debian.org/debian bullseye/main amd64 fontconfig-config all 2.13.1-4.2 [281 kB]
Get:74 https://deb.debian.org/debian bullseye/main amd64 gnupg-l10n all 2.2.27-2 [1084 kB]
Get:75 https://deb.debian.org/debian bullseye/main amd64 gnupg-utils amd64 2.2.27-2 [905 kB]
Get:76 https://deb.debian.org/debian bullseye/main amd64 gpg amd64 2.2.27-2 [927 kB]
Get:77 https://deb.debian.org/debian bullseye/main amd64 pinentry-curses amd64 1.1.0-4 [64.9 kB]
Get:78 https://deb.debian.org/debian bullseye/main amd64 gpg-agent amd64 2.2.27-2 [669 kB]
Get:79 https://deb.debian.org/debian bullseye/main amd64 gpg-wks-client amd64 2.2.27-2 [523 kB]
Get:80 https://deb.debian.org/debian bullseye/main amd64 gpg-wks-server amd64 2.2.27-2 [516 kB]
Get:81 https://deb.debian.org/debian bullseye/main amd64 gpgsm amd64 2.2.27-2 [645 kB]
Get:82 https://deb.debian.org/debian bullseye/main amd64 gnupg all 2.2.27-2 [825 kB]
Get:83 https://deb.debian.org/debian bullseye/main amd64 javascript-common all 11+nmu1 [6260 B]
Get:84 https://deb.debian.org/debian bullseye/main amd64 libalgorithm-diff-perl all 1.201-1 [43.3 kB]
Get:85 https://deb.debian.org/debian bullseye/main amd64 libalgorithm-diff-xs-perl amd64 0.04-6+b1 [12.0 kB]
Get:86 https://deb.debian.org/debian bullseye/main amd64 libalgorithm-merge-perl all 0.08-3 [12.7 kB]
Get:87 https://deb.debian.org/debian bullseye/main amd64 libbrotli1 amd64 1.0.9-2+b2 [279 kB]
Get:88 https://deb.debian.org/debian bullseye/main amd64 libmd0 amd64 1.0.3-3 [28.0 kB]
Get:89 https://deb.debian.org/debian bullseye/main amd64 libbsd0 amd64 0.11.3-1 [108 kB]
Get:90 https://deb.debian.org/debian bullseye/main amd64 libpng16-16 amd64 1.6.37-3 [294 kB]
Get:91 https://deb.debian.org/debian bullseye/main amd64 libfreetype6 amd64 2.10.4+dfsg-1 [418 kB]
Get:92 https://deb.debian.org/debian bullseye/main amd64 libfontconfig1 amd64 2.13.1-4.2 [347 kB]
Get:93 https://deb.debian.org/debian bullseye/main amd64 libjpeg62-turbo amd64 1:2.0.6-4 [151 kB]
Get:94 https://deb.debian.org/debian bullseye/main amd64 libdeflate0 amd64 1.7-1 [53.1 kB]
Get:95 https://deb.debian.org/debian bullseye/main amd64 libjbig0 amd64 2.1-3.1+b2 [31.0 kB]
Get:96 https://deb.debian.org/debian bullseye/main amd64 libwebp6 amd64 0.6.1-2.1 [258 kB]
Get:97 https://deb.debian.org/debian bullseye/main amd64 libtiff5 amd64 4.2.0-1 [289 kB]
Get:98 https://deb.debian.org/debian bullseye/main amd64 libxau6 amd64 1:1.0.9-1 [19.7 kB]
Get:99 https://deb.debian.org/debian bullseye/main amd64 libxdmcp6 amd64 1:1.1.2-3 [26.3 kB]
Get:100 https://deb.debian.org/debian bullseye/main amd64 libxcb1 amd64 1.14-3 [140 kB]
Get:101 https://deb.debian.org/debian bullseye/main amd64 libx11-data all 2:1.7.2-1 [311 kB]
Get:102 https://deb.debian.org/debian bullseye/main amd64 libx11-6 amd64 2:1.7.2-1 [772 kB]
Get:103 https://deb.debian.org/debian bullseye/main amd64 libxpm4 amd64 1:3.5.12-1 [49.1 kB]
Get:104 https://deb.debian.org/debian bullseye/main amd64 libgd3 amd64 2.3.0-2 [137 kB]
Get:105 https://deb.debian.org/debian bullseye/main amd64 libc-devtools amd64 2.31-13 [245 kB]
Get:106 https://deb.debian.org/debian bullseye/main amd64 libexpat1-dev amd64 2.2.10-2 [140 kB]
Get:107 https://deb.debian.org/debian bullseye/main amd64 libfile-fcntllock-perl amd64 0.22-3+b7 [35.5 kB]
Get:108 https://deb.debian.org/debian bullseye/main amd64 libjs-jquery all 3.5.1+dfsg+~3.5.5-7 [315 kB]
Get:109 https://deb.debian.org/debian bullseye/main amd64 libjs-underscore all 1.9.1~dfsg-3 [100 kB]
Get:110 https://deb.debian.org/debian bullseye/main amd64 libjs-sphinxdoc all 3.4.3-2 [127 kB]
Get:111 https://deb.debian.org/debian bullseye/main amd64 libldap-common all 2.4.57+dfsg-3 [95.9 kB]
Get:112 https://deb.debian.org/debian bullseye/main amd64 libpython3.9 amd64 3.9.2-1 [1691 kB]
Get:113 https://deb.debian.org/debian bullseye/main amd64 libpython3.9-dev amd64 3.9.2-1 [4028 kB]
Get:114 https://deb.debian.org/debian bullseye/main amd64 libpython3-dev amd64 3.9.2-3 [21.7 kB]
Get:115 https://deb.debian.org/debian bullseye/main amd64 libsasl2-modules amd64 2.1.27+dfsg-2.1 [104 kB]
Get:116 https://deb.debian.org/debian bullseye/main amd64 manpages-dev all 5.10-1 [2309 kB]
Get:117 https://deb.debian.org/debian bullseye/main amd64 python-pip-whl all 20.3.4-4 [1948 kB]
Get:118 https://deb.debian.org/debian bullseye/main amd64 zlib1g-dev amd64 1:1.2.11.dfsg-2 [190 kB]
Get:119 https://deb.debian.org/debian bullseye/main amd64 python3.9-dev amd64 3.9.2-1 [515 kB]
Get:120 https://deb.debian.org/debian bullseye/main amd64 python3-lib2to3 all 3.9.2-1 [77.8 kB]
Get:121 https://deb.debian.org/debian bullseye/main amd64 python3-distutils all 3.9.2-1 [143 kB]
Get:122 https://deb.debian.org/debian bullseye/main amd64 python3-dev amd64 3.9.2-3 [24.8 kB]
Get:123 https://deb.debian.org/debian bullseye/main amd64 python3-pkg-resources all 52.0.0-4 [190 kB]
Get:124 https://deb.debian.org/debian bullseye/main amd64 python3-setuptools all 52.0.0-4 [366 kB]
Get:125 https://deb.debian.org/debian bullseye/main amd64 python3-wheel all 0.34.2-1 [24.0 kB]
Get:126 https://deb.debian.org/debian bullseye/main amd64 python3-pip all 20.3.4-4 [337 kB]
debconf: delaying package configuration, since apt-utils is not installed
Fetched 102 MB in 7s (15.2 MB/s)
Selecting previously unselected package perl-modules-5.32.
(Reading database ... 
(Reading database ... 5%
(Reading database ... 10%
(Reading database ... 15%
(Reading database ... 20%
(Reading database ... 25%
(Reading database ... 30%
(Reading database ... 35%
(Reading database ... 40%
(Reading database ... 45%
(Reading database ... 50%
(Reading database ... 55%
(Reading database ... 60%
(Reading database ... 65%
(Reading database ... 70%
(Reading database ... 75%
(Reading database ... 80%
(Reading database ... 85%
(Reading database ... 90%
(Reading database ... 95%
(Reading database ... 100%
(Reading database ... 7485 files and directories currently installed.)
Preparing to unpack .../0-perl-modules-5.32_5.32.1-4+deb11u1_all.deb ...
Unpacking perl-modules-5.32 (5.32.1-4+deb11u1) ...
Selecting previously unselected package libgdbm6:amd64.
Preparing to unpack .../1-libgdbm6_1.19-2_amd64.deb ...
Unpacking libgdbm6:amd64 (1.19-2) ...
Selecting previously unselected package libgdbm-compat4:amd64.
Preparing to unpack .../2-libgdbm-compat4_1.19-2_amd64.deb ...
Unpacking libgdbm-compat4:amd64 (1.19-2) ...
Selecting previously unselected package libperl5.32:amd64.
Preparing to unpack .../3-libperl5.32_5.32.1-4+deb11u1_amd64.deb ...
Unpacking libperl5.32:amd64 (5.32.1-4+deb11u1) ...
Selecting previously unselected package perl.
Preparing to unpack .../4-perl_5.32.1-4+deb11u1_amd64.deb ...
Unpacking perl (5.32.1-4+deb11u1) ...
Selecting previously unselected package liblocale-gettext-perl.
Preparing to unpack .../5-liblocale-gettext-perl_1.07-4+b1_amd64.deb ...
Unpacking liblocale-gettext-perl (1.07-4+b1) ...
Selecting previously unselected package libpython3.9-minimal:amd64.
Preparing to unpack .../6-libpython3.9-minimal_3.9.2-1_amd64.deb ...
Unpacking libpython3.9-minimal:amd64 (3.9.2-1) ...
Selecting previously unselected package libexpat1:amd64.
Preparing to unpack .../7-libexpat1_2.2.10-2_amd64.deb ...
Unpacking libexpat1:amd64 (2.2.10-2) ...
Selecting previously unselected package python3.9-minimal.
Preparing to unpack .../8-python3.9-minimal_3.9.2-1_amd64.deb ...
Unpacking python3.9-minimal (3.9.2-1) ...
Setting up libpython3.9-minimal:amd64 (3.9.2-1) ...
Setting up libexpat1:amd64 (2.2.10-2) ...
Setting up python3.9-minimal (3.9.2-1) ...
Selecting previously unselected package python3-minimal.
(Reading database ... 
(Reading database ... 5%
(Reading database ... 10%
(Reading database ... 15%
(Reading database ... 20%
(Reading database ... 25%
(Reading database ... 30%
(Reading database ... 35%
(Reading database ... 40%
(Reading database ... 45%
(Reading database ... 50%
(Reading database ... 55%
(Reading database ... 60%
(Reading database ... 65%
(Reading database ... 70%
(Reading database ... 75%
(Reading database ... 80%
(Reading database ... 85%
(Reading database ... 90%
(Reading database ... 95%
(Reading database ... 100%
(Reading database ... 9765 files and directories currently installed.)
Preparing to unpack .../0-python3-minimal_3.9.2-3_amd64.deb ...
Unpacking python3-minimal (3.9.2-3) ...
Selecting previously unselected package media-types.
Preparing to unpack .../1-media-types_4.0.0_all.deb ...
Unpacking media-types (4.0.0) ...
Selecting previously unselected package libmpdec3:amd64.
Preparing to unpack .../2-libmpdec3_2.5.1-1_amd64.deb ...
Unpacking libmpdec3:amd64 (2.5.1-1) ...
Selecting previously unselected package readline-common.
Preparing to unpack .../3-readline-common_8.1-1_all.deb ...
Unpacking readline-common (8.1-1) ...
Selecting previously unselected package libreadline8:amd64.
Preparing to unpack .../4-libreadline8_8.1-1_amd64.deb ...
Unpacking libreadline8:amd64 (8.1-1) ...
Selecting previously unselected package libpython3.9-stdlib:amd64.
Preparing to unpack .../5-libpython3.9-stdlib_3.9.2-1_amd64.deb ...
Unpacking libpython3.9-stdlib:amd64 (3.9.2-1) ...
Selecting previously unselected package python3.9.
Preparing to unpack .../6-python3.9_3.9.2-1_amd64.deb ...
Unpacking python3.9 (3.9.2-1) ...
Selecting previously unselected package libpython3-stdlib:amd64.
Preparing to unpack .../7-libpython3-stdlib_3.9.2-3_amd64.deb ...
Unpacking libpython3-stdlib:amd64 (3.9.2-3) ...
Setting up python3-minimal (3.9.2-3) ...
Selecting previously unselected package python3.
(Reading database ... 
(Reading database ... 5%
(Reading database ... 10%
(Reading database ... 15%
(Reading database ... 20%
(Reading database ... 25%
(Reading database ... 30%
(Reading database ... 35%
(Reading database ... 40%
(Reading database ... 45%
(Reading database ... 50%
(Reading database ... 55%
(Reading database ... 60%
(Reading database ... 65%
(Reading database ... 70%
(Reading database ... 75%
(Reading database ... 80%
(Reading database ... 85%
(Reading database ... 90%
(Reading database ... 95%
(Reading database ... 100%
(Reading database ... 10186 files and directories currently installed.)
Preparing to unpack .../000-python3_3.9.2-3_amd64.deb ...
Unpacking python3 (3.9.2-3) ...
Selecting previously unselected package netbase.
Preparing to unpack .../001-netbase_6.3_all.deb ...
Unpacking netbase (6.3) ...
Selecting previously unselected package sensible-utils.
Preparing to unpack .../002-sensible-utils_0.0.14_all.deb ...
Unpacking sensible-utils (0.0.14) ...
Selecting previously unselected package bzip2.
Preparing to unpack .../003-bzip2_1.0.8-4_amd64.deb ...
Unpacking bzip2 (1.0.8-4) ...
Selecting previously unselected package manpages.
Preparing to unpack .../004-manpages_5.10-1_all.deb ...
Unpacking manpages (5.10-1) ...
Selecting previously unselected package ucf.
Preparing to unpack .../005-ucf_3.0043_all.deb ...
Moving old data out of the way
Unpacking ucf (3.0043) ...
Selecting previously unselected package xz-utils.
Preparing to unpack .../006-xz-utils_5.2.5-2_amd64.deb ...
Unpacking xz-utils (5.2.5-2) ...
Selecting previously unselected package binutils-common:amd64.
Preparing to unpack .../007-binutils-common_2.35.2-2_amd64.deb ...
Unpacking binutils-common:amd64 (2.35.2-2) ...
Selecting previously unselected package libbinutils:amd64.
Preparing to unpack .../008-libbinutils_2.35.2-2_amd64.deb ...
Unpacking libbinutils:amd64 (2.35.2-2) ...
Selecting previously unselected package libctf-nobfd0:amd64.
Preparing to unpack .../009-libctf-nobfd0_2.35.2-2_amd64.deb ...
Unpacking libctf-nobfd0:amd64 (2.35.2-2) ...
Selecting previously unselected package libctf0:amd64.
Preparing to unpack .../010-libctf0_2.35.2-2_amd64.deb ...
Unpacking libctf0:amd64 (2.35.2-2) ...
Selecting previously unselected package binutils-x86-64-linux-gnu.
Preparing to unpack .../011-binutils-x86-64-linux-gnu_2.35.2-2_amd64.deb ...
Unpacking binutils-x86-64-linux-gnu (2.35.2-2) ...
Selecting previously unselected package binutils.
Preparing to unpack .../012-binutils_2.35.2-2_amd64.deb ...
Unpacking binutils (2.35.2-2) ...
Selecting previously unselected package libc-dev-bin.
Preparing to unpack .../013-libc-dev-bin_2.31-13_amd64.deb ...
Unpacking libc-dev-bin (2.31-13) ...
Selecting previously unselected package linux-libc-dev:amd64.
Preparing to unpack .../014-linux-libc-dev_5.10.46-4_amd64.deb ...
Unpacking linux-libc-dev:amd64 (5.10.46-4) ...
Selecting previously unselected package libcrypt-dev:amd64.
Preparing to unpack .../015-libcrypt-dev_1%3a4.4.18-4_amd64.deb ...
Unpacking libcrypt-dev:amd64 (1:4.4.18-4) ...
Selecting previously unselected package libtirpc-dev:amd64.
Preparing to unpack .../016-libtirpc-dev_1.3.1-1_amd64.deb ...
Unpacking libtirpc-dev:amd64 (1.3.1-1) ...
Selecting previously unselected package libnsl-dev:amd64.
Preparing to unpack .../017-libnsl-dev_1.3.0-2_amd64.deb ...
Unpacking libnsl-dev:amd64 (1.3.0-2) ...
Selecting previously unselected package libc6-dev:amd64.
Preparing to unpack .../018-libc6-dev_2.31-13_amd64.deb ...
Unpacking libc6-dev:amd64 (2.31-13) ...
Selecting previously unselected package libisl23:amd64.
Preparing to unpack .../019-libisl23_0.23-1_amd64.deb ...
Unpacking libisl23:amd64 (0.23-1) ...
Selecting previously unselected package libmpfr6:amd64.
Preparing to unpack .../020-libmpfr6_4.1.0-3_amd64.deb ...
Unpacking libmpfr6:amd64 (4.1.0-3) ...
Selecting previously unselected package libmpc3:amd64.
Preparing to unpack .../021-libmpc3_1.2.0-1_amd64.deb ...
Unpacking libmpc3:amd64 (1.2.0-1) ...
Selecting previously unselected package cpp-10.
Preparing to unpack .../022-cpp-10_10.2.1-6_amd64.deb ...
Unpacking cpp-10 (10.2.1-6) ...
Selecting previously unselected package cpp.
Preparing to unpack .../023-cpp_4%3a10.2.1-1_amd64.deb ...
Unpacking cpp (4:10.2.1-1) ...
Selecting previously unselected package libcc1-0:amd64.
Preparing to unpack .../024-libcc1-0_10.2.1-6_amd64.deb ...
Unpacking libcc1-0:amd64 (10.2.1-6) ...
Selecting previously unselected package libgomp1:amd64.
Preparing to unpack .../025-libgomp1_10.2.1-6_amd64.deb ...
Unpacking libgomp1:amd64 (10.2.1-6) ...
Selecting previously unselected package libitm1:amd64.
Preparing to unpack .../026-libitm1_10.2.1-6_amd64.deb ...
Unpacking libitm1:amd64 (10.2.1-6) ...
Selecting previously unselected package libatomic1:amd64.
Preparing to unpack .../027-libatomic1_10.2.1-6_amd64.deb ...
Unpacking libatomic1:amd64 (10.2.1-6) ...
Selecting previously unselected package libasan6:amd64.
Preparing to unpack .../028-libasan6_10.2.1-6_amd64.deb ...
Unpacking libasan6:amd64 (10.2.1-6) ...
Selecting previously unselected package liblsan0:amd64.
Preparing to unpack .../029-liblsan0_10.2.1-6_amd64.deb ...
Unpacking liblsan0:amd64 (10.2.1-6) ...
Selecting previously unselected package libtsan0:amd64.
Preparing to unpack .../030-libtsan0_10.2.1-6_amd64.deb ...
Unpacking libtsan0:amd64 (10.2.1-6) ...
Selecting previously unselected package libubsan1:amd64.
Preparing to unpack .../031-libubsan1_10.2.1-6_amd64.deb ...
Unpacking libubsan1:amd64 (10.2.1-6) ...
Selecting previously unselected package libquadmath0:amd64.
Preparing to unpack .../032-libquadmath0_10.2.1-6_amd64.deb ...
Unpacking libquadmath0:amd64 (10.2.1-6) ...
Selecting previously unselected package libgcc-10-dev:amd64.
Preparing to unpack .../033-libgcc-10-dev_10.2.1-6_amd64.deb ...
Unpacking libgcc-10-dev:amd64 (10.2.1-6) ...
Selecting previously unselected package gcc-10.
Preparing to unpack .../034-gcc-10_10.2.1-6_amd64.deb ...
Unpacking gcc-10 (10.2.1-6) ...
Selecting previously unselected package gcc.
Preparing to unpack .../035-gcc_4%3a10.2.1-1_amd64.deb ...
Unpacking gcc (4:10.2.1-1) ...
Selecting previously unselected package libstdc++-10-dev:amd64.
Preparing to unpack .../036-libstdc++-10-dev_10.2.1-6_amd64.deb ...
Unpacking libstdc++-10-dev:amd64 (10.2.1-6) ...
Selecting previously unselected package g++-10.
Preparing to unpack .../037-g++-10_10.2.1-6_amd64.deb ...
Unpacking g++-10 (10.2.1-6) ...
Selecting previously unselected package g++.
Preparing to unpack .../038-g++_4%3a10.2.1-1_amd64.deb ...
Unpacking g++ (4:10.2.1-1) ...
Selecting previously unselected package make.
Preparing to unpack .../039-make_4.3-4.1_amd64.deb ...
Unpacking make (4.3-4.1) ...
Selecting previously unselected package libdpkg-perl.
Preparing to unpack .../040-libdpkg-perl_1.20.9_all.deb ...
Unpacking libdpkg-perl (1.20.9) ...
Selecting previously unselected package patch.
Preparing to unpack .../041-patch_2.7.6-7_amd64.deb ...
Unpacking patch (2.7.6-7) ...
Selecting previously unselected package dpkg-dev.
Preparing to unpack .../042-dpkg-dev_1.20.9_all.deb ...
Unpacking dpkg-dev (1.20.9) ...
Selecting previously unselected package build-essential.
Preparing to unpack .../043-build-essential_12.9_amd64.deb ...
Unpacking build-essential (12.9) ...
Selecting previously unselected package libassuan0:amd64.
Preparing to unpack .../044-libassuan0_2.5.3-7.1_amd64.deb ...
Unpacking libassuan0:amd64 (2.5.3-7.1) ...
Selecting previously unselected package gpgconf.
Preparing to unpack .../045-gpgconf_2.2.27-2_amd64.deb ...
Unpacking gpgconf (2.2.27-2) ...
Selecting previously unselected package libksba8:amd64.
Preparing to unpack .../046-libksba8_1.5.0-3_amd64.deb ...
Unpacking libksba8:amd64 (1.5.0-3) ...
Selecting previously unselected package libsasl2-modules-db:amd64.
Preparing to unpack .../047-libsasl2-modules-db_2.1.27+dfsg-2.1_amd64.deb ...
Unpacking libsasl2-modules-db:amd64 (2.1.27+dfsg-2.1) ...
Selecting previously unselected package libsasl2-2:amd64.
Preparing to unpack .../048-libsasl2-2_2.1.27+dfsg-2.1_amd64.deb ...
Unpacking libsasl2-2:amd64 (2.1.27+dfsg-2.1) ...
Selecting previously unselected package libldap-2.4-2:amd64.
Preparing to unpack .../049-libldap-2.4-2_2.4.57+dfsg-3_amd64.deb ...
Unpacking libldap-2.4-2:amd64 (2.4.57+dfsg-3) ...
Selecting previously unselected package libnpth0:amd64.
Preparing to unpack .../050-libnpth0_1.6-3_amd64.deb ...
Unpacking libnpth0:amd64 (1.6-3) ...
Selecting previously unselected package dirmngr.
Preparing to unpack .../051-dirmngr_2.2.27-2_amd64.deb ...
Unpacking dirmngr (2.2.27-2) ...
Selecting previously unselected package libfakeroot:amd64.
Preparing to unpack .../052-libfakeroot_1.25.3-1.1_amd64.deb ...
Unpacking libfakeroot:amd64 (1.25.3-1.1) ...
Selecting previously unselected package fakeroot.
Preparing to unpack .../053-fakeroot_1.25.3-1.1_amd64.deb ...
Unpacking fakeroot (1.25.3-1.1) ...
Selecting previously unselected package fonts-dejavu-core.
Preparing to unpack .../054-fonts-dejavu-core_2.37-2_all.deb ...
Unpacking fonts-dejavu-core (2.37-2) ...
Selecting previously unselected package fontconfig-config.
Preparing to unpack .../055-fontconfig-config_2.13.1-4.2_all.deb ...
Unpacking fontconfig-config (2.13.1-4.2) ...
Selecting previously unselected package gnupg-l10n.
Preparing to unpack .../056-gnupg-l10n_2.2.27-2_all.deb ...
Unpacking gnupg-l10n (2.2.27-2) ...
Selecting previously unselected package gnupg-utils.
Preparing to unpack .../057-gnupg-utils_2.2.27-2_amd64.deb ...
Unpacking gnupg-utils (2.2.27-2) ...
Selecting previously unselected package gpg.
Preparing to unpack .../058-gpg_2.2.27-2_amd64.deb ...
Unpacking gpg (2.2.27-2) ...
Selecting previously unselected package pinentry-curses.
Preparing to unpack .../059-pinentry-curses_1.1.0-4_amd64.deb ...
Unpacking pinentry-curses (1.1.0-4) ...
Selecting previously unselected package gpg-agent.
Preparing to unpack .../060-gpg-agent_2.2.27-2_amd64.deb ...
Unpacking gpg-agent (2.2.27-2) ...
Selecting previously unselected package gpg-wks-client.
Preparing to unpack .../061-gpg-wks-client_2.2.27-2_amd64.deb ...
Unpacking gpg-wks-client (2.2.27-2) ...
Selecting previously unselected package gpg-wks-server.
Preparing to unpack .../062-gpg-wks-server_2.2.27-2_amd64.deb ...
Unpacking gpg-wks-server (2.2.27-2) ...
Selecting previously unselected package gpgsm.
Preparing to unpack .../063-gpgsm_2.2.27-2_amd64.deb ...
Unpacking gpgsm (2.2.27-2) ...
Selecting previously unselected package gnupg.
Preparing to unpack .../064-gnupg_2.2.27-2_all.deb ...
Unpacking gnupg (2.2.27-2) ...
Selecting previously unselected package javascript-common.
Preparing to unpack .../065-javascript-common_11+nmu1_all.deb ...
Unpacking javascript-common (11+nmu1) ...
Selecting previously unselected package libalgorithm-diff-perl.
Preparing to unpack .../066-libalgorithm-diff-perl_1.201-1_all.deb ...
Unpacking libalgorithm-diff-perl (1.201-1) ...
Selecting previously unselected package libalgorithm-diff-xs-perl.
Preparing to unpack .../067-libalgorithm-diff-xs-perl_0.04-6+b1_amd64.deb ...
Unpacking libalgorithm-diff-xs-perl (0.04-6+b1) ...
Selecting previously unselected package libalgorithm-merge-perl.
Preparing to unpack .../068-libalgorithm-merge-perl_0.08-3_all.deb ...
Unpacking libalgorithm-merge-perl (0.08-3) ...
Selecting previously unselected package libbrotli1:amd64.
Preparing to unpack .../069-libbrotli1_1.0.9-2+b2_amd64.deb ...
Unpacking libbrotli1:amd64 (1.0.9-2+b2) ...
Selecting previously unselected package libmd0:amd64.
Preparing to unpack .../070-libmd0_1.0.3-3_amd64.deb ...
Unpacking libmd0:amd64 (1.0.3-3) ...
Selecting previously unselected package libbsd0:amd64.
Preparing to unpack .../071-libbsd0_0.11.3-1_amd64.deb ...
Unpacking libbsd0:amd64 (0.11.3-1) ...
Selecting previously unselected package libpng16-16:amd64.
Preparing to unpack .../072-libpng16-16_1.6.37-3_amd64.deb ...
Unpacking libpng16-16:amd64 (1.6.37-3) ...
Selecting previously unselected package libfreetype6:amd64.
Preparing to unpack .../073-libfreetype6_2.10.4+dfsg-1_amd64.deb ...
Unpacking libfreetype6:amd64 (2.10.4+dfsg-1) ...
Selecting previously unselected package libfontconfig1:amd64.
Preparing to unpack .../074-libfontconfig1_2.13.1-4.2_amd64.deb ...
Unpacking libfontconfig1:amd64 (2.13.1-4.2) ...
Selecting previously unselected package libjpeg62-turbo:amd64.
Preparing to unpack .../075-libjpeg62-turbo_1%3a2.0.6-4_amd64.deb ...
Unpacking libjpeg62-turbo:amd64 (1:2.0.6-4) ...
Selecting previously unselected package libdeflate0:amd64.
Preparing to unpack .../076-libdeflate0_1.7-1_amd64.deb ...
Unpacking libdeflate0:amd64 (1.7-1) ...
Selecting previously unselected package libjbig0:amd64.
Preparing to unpack .../077-libjbig0_2.1-3.1+b2_amd64.deb ...
Unpacking libjbig0:amd64 (2.1-3.1+b2) ...
Selecting previously unselected package libwebp6:amd64.
Preparing to unpack .../078-libwebp6_0.6.1-2.1_amd64.deb ...
Unpacking libwebp6:amd64 (0.6.1-2.1) ...
Selecting previously unselected package libtiff5:amd64.
Preparing to unpack .../079-libtiff5_4.2.0-1_amd64.deb ...
Unpacking libtiff5:amd64 (4.2.0-1) ...
Selecting previously unselected package libxau6:amd64.
Preparing to unpack .../080-libxau6_1%3a1.0.9-1_amd64.deb ...
Unpacking libxau6:amd64 (1:1.0.9-1) ...
Selecting previously unselected package libxdmcp6:amd64.
Preparing to unpack .../081-libxdmcp6_1%3a1.1.2-3_amd64.deb ...
Unpacking libxdmcp6:amd64 (1:1.1.2-3) ...
Selecting previously unselected package libxcb1:amd64.
Preparing to unpack .../082-libxcb1_1.14-3_amd64.deb ...
Unpacking libxcb1:amd64 (1.14-3) ...
Selecting previously unselected package libx11-data.
Preparing to unpack .../083-libx11-data_2%3a1.7.2-1_all.deb ...
Unpacking libx11-data (2:1.7.2-1) ...
Selecting previously unselected package libx11-6:amd64.
Preparing to unpack .../084-libx11-6_2%3a1.7.2-1_amd64.deb ...
Unpacking libx11-6:amd64 (2:1.7.2-1) ...
Selecting previously unselected package libxpm4:amd64.
Preparing to unpack .../085-libxpm4_1%3a3.5.12-1_amd64.deb ...
Unpacking libxpm4:amd64 (1:3.5.12-1) ...
Selecting previously unselected package libgd3:amd64.
Preparing to unpack .../086-libgd3_2.3.0-2_amd64.deb ...
Unpacking libgd3:amd64 (2.3.0-2) ...
Selecting previously unselected package libc-devtools.
Preparing to unpack .../087-libc-devtools_2.31-13_amd64.deb ...
Unpacking libc-devtools (2.31-13) ...
Selecting previously unselected package libexpat1-dev:amd64.
Preparing to unpack .../088-libexpat1-dev_2.2.10-2_amd64.deb ...
Unpacking libexpat1-dev:amd64 (2.2.10-2) ...
Selecting previously unselected package libfile-fcntllock-perl.
Preparing to unpack .../089-libfile-fcntllock-perl_0.22-3+b7_amd64.deb ...
Unpacking libfile-fcntllock-perl (0.22-3+b7) ...
Selecting previously unselected package libjs-jquery.
Preparing to unpack .../090-libjs-jquery_3.5.1+dfsg+~3.5.5-7_all.deb ...
Unpacking libjs-jquery (3.5.1+dfsg+~3.5.5-7) ...
Selecting previously unselected package libjs-underscore.
Preparing to unpack .../091-libjs-underscore_1.9.1~dfsg-3_all.deb ...
Unpacking libjs-underscore (1.9.1~dfsg-3) ...
Selecting previously unselected package libjs-sphinxdoc.
Preparing to unpack .../092-libjs-sphinxdoc_3.4.3-2_all.deb ...
Unpacking libjs-sphinxdoc (3.4.3-2) ...
Selecting previously unselected package libldap-common.
Preparing to unpack .../093-libldap-common_2.4.57+dfsg-3_all.deb ...
Unpacking libldap-common (2.4.57+dfsg-3) ...
Selecting previously unselected package libpython3.9:amd64.
Preparing to unpack .../094-libpython3.9_3.9.2-1_amd64.deb ...
Unpacking libpython3.9:amd64 (3.9.2-1) ...
Selecting previously unselected package libpython3.9-dev:amd64.
Preparing to unpack .../095-libpython3.9-dev_3.9.2-1_amd64.deb ...
Unpacking libpython3.9-dev:amd64 (3.9.2-1) ...
Selecting previously unselected package libpython3-dev:amd64.
Preparing to unpack .../096-libpython3-dev_3.9.2-3_amd64.deb ...
Unpacking libpython3-dev:amd64 (3.9.2-3) ...
Selecting previously unselected package libsasl2-modules:amd64.
Preparing to unpack .../097-libsasl2-modules_2.1.27+dfsg-2.1_amd64.deb ...
Unpacking libsasl2-modules:amd64 (2.1.27+dfsg-2.1) ...
Selecting previously unselected package manpages-dev.
Preparing to unpack .../098-manpages-dev_5.10-1_all.deb ...
Unpacking manpages-dev (5.10-1) ...
Selecting previously unselected package python-pip-whl.
Preparing to unpack .../099-python-pip-whl_20.3.4-4_all.deb ...
Unpacking python-pip-whl (20.3.4-4) ...
Selecting previously unselected package zlib1g-dev:amd64.
Preparing to unpack .../100-zlib1g-dev_1%3a1.2.11.dfsg-2_amd64.deb ...
Unpacking zlib1g-dev:amd64 (1:1.2.11.dfsg-2) ...
Selecting previously unselected package python3.9-dev.
Preparing to unpack .../101-python3.9-dev_3.9.2-1_amd64.deb ...
Unpacking python3.9-dev (3.9.2-1) ...
Selecting previously unselected package python3-lib2to3.
Preparing to unpack .../102-python3-lib2to3_3.9.2-1_all.deb ...
Unpacking python3-lib2to3 (3.9.2-1) ...
Selecting previously unselected package python3-distutils.
Preparing to unpack .../103-python3-distutils_3.9.2-1_all.deb ...
Unpacking python3-distutils (3.9.2-1) ...
Selecting previously unselected package python3-dev.
Preparing to unpack .../104-python3-dev_3.9.2-3_amd64.deb ...
Unpacking python3-dev (3.9.2-3) ...
Selecting previously unselected package python3-pkg-resources.
Preparing to unpack .../105-python3-pkg-resources_52.0.0-4_all.deb ...
Unpacking python3-pkg-resources (52.0.0-4) ...
Selecting previously unselected package python3-setuptools.
Preparing to unpack .../106-python3-setuptools_52.0.0-4_all.deb ...
Unpacking python3-setuptools (52.0.0-4) ...
Selecting previously unselected package python3-wheel.
Preparing to unpack .../107-python3-wheel_0.34.2-1_all.deb ...
Unpacking python3-wheel (0.34.2-1) ...
Selecting previously unselected package python3-pip.
Preparing to unpack .../108-python3-pip_20.3.4-4_all.deb ...
Unpacking python3-pip (20.3.4-4) ...
Setting up libksba8:amd64 (1.5.0-3) ...
Setting up media-types (4.0.0) ...
Setting up javascript-common (11+nmu1) ...
Setting up libxau6:amd64 (1:1.0.9-1) ...
Setting up manpages (5.10-1) ...
Setting up perl-modules-5.32 (5.32.1-4+deb11u1) ...
Setting up libbrotli1:amd64 (1.0.9-2+b2) ...
Setting up libsasl2-modules:amd64 (2.1.27+dfsg-2.1) ...
Setting up binutils-common:amd64 (2.35.2-2) ...
Setting up libdeflate0:amd64 (1.7-1) ...
Setting up linux-libc-dev:amd64 (5.10.46-4) ...
Setting up libctf-nobfd0:amd64 (2.35.2-2) ...
Setting up libnpth0:amd64 (1.6-3) ...
Setting up libassuan0:amd64 (2.5.3-7.1) ...
Setting up libgomp1:amd64 (10.2.1-6) ...
Setting up bzip2 (1.0.8-4) ...
Setting up libldap-common (2.4.57+dfsg-3) ...
Setting up libjbig0:amd64 (2.1-3.1+b2) ...
Setting up libfakeroot:amd64 (1.25.3-1.1) ...
Setting up libasan6:amd64 (10.2.1-6) ...
Setting up libsasl2-modules-db:amd64 (2.1.27+dfsg-2.1) ...
Setting up fakeroot (1.25.3-1.1) ...
update-alternatives: using /usr/bin/fakeroot-sysv to provide /usr/bin/fakeroot (fakeroot) in auto mode
update-alternatives: warning: skip creation of /usr/share/man/man1/fakeroot.1.gz because associated file /usr/share/man/man1/fakeroot-sysv.1.gz (of link group fakeroot) doesn't exist
update-alternatives: warning: skip creation of /usr/share/man/man1/faked.1.gz because associated file /usr/share/man/man1/faked-sysv.1.gz (of link group fakeroot) doesn't exist
update-alternatives: warning: skip creation of /usr/share/man/es/man1/fakeroot.1.gz because associated file /usr/share/man/es/man1/fakeroot-sysv.1.gz (of link group fakeroot) doesn't exist
update-alternatives: warning: skip creation of /usr/share/man/es/man1/faked.1.gz because associated file /usr/share/man/es/man1/faked-sysv.1.gz (of link group fakeroot) doesn't exist
update-alternatives: warning: skip creation of /usr/share/man/fr/man1/fakeroot.1.gz because associated file /usr/share/man/fr/man1/fakeroot-sysv.1.gz (of link group fakeroot) doesn't exist
update-alternatives: warning: skip creation of /usr/share/man/fr/man1/faked.1.gz because associated file /usr/share/man/fr/man1/faked-sysv.1.gz (of link group fakeroot) doesn't exist
update-alternatives: warning: skip creation of /usr/share/man/sv/man1/fakeroot.1.gz because associated file /usr/share/man/sv/man1/fakeroot-sysv.1.gz (of link group fakeroot) doesn't exist
update-alternatives: warning: skip creation of /usr/share/man/sv/man1/faked.1.gz because associated file /usr/share/man/sv/man1/faked-sysv.1.gz (of link group fakeroot) doesn't exist
Setting up libtirpc-dev:amd64 (1.3.1-1) ...
Setting up libjpeg62-turbo:amd64 (1:2.0.6-4) ...
Setting up libx11-data (2:1.7.2-1) ...
Setting up make (4.3-4.1) ...
Setting up libmpfr6:amd64 (4.1.0-3) ...
Setting up gnupg-l10n (2.2.27-2) ...
Setting up xz-utils (5.2.5-2) ...
update-alternatives: using /usr/bin/xz to provide /usr/bin/lzma (lzma) in auto mode
update-alternatives: warning: skip creation of /usr/share/man/man1/lzma.1.gz because associated file /usr/share/man/man1/xz.1.gz (of link group lzma) doesn't exist
update-alternatives: warning: skip creation of /usr/share/man/man1/unlzma.1.gz because associated file /usr/share/man/man1/unxz.1.gz (of link group lzma) doesn't exist
update-alternatives: warning: skip creation of /usr/share/man/man1/lzcat.1.gz because associated file /usr/share/man/man1/xzcat.1.gz (of link group lzma) doesn't exist
update-alternatives: warning: skip creation of /usr/share/man/man1/lzmore.1.gz because associated file /usr/share/man/man1/xzmore.1.gz (of link group lzma) doesn't exist
update-alternatives: warning: skip creation of /usr/share/man/man1/lzless.1.gz because associated file /usr/share/man/man1/xzless.1.gz (of link group lzma) doesn't exist
update-alternatives: warning: skip creation of /usr/share/man/man1/lzdiff.1.gz because associated file /usr/share/man/man1/xzdiff.1.gz (of link group lzma) doesn't exist
update-alternatives: warning: skip creation of /usr/share/man/man1/lzcmp.1.gz because associated file /usr/share/man/man1/xzcmp.1.gz (of link group lzma) doesn't exist
update-alternatives: warning: skip creation of /usr/share/man/man1/lzgrep.1.gz because associated file /usr/share/man/man1/xzgrep.1.gz (of link group lzma) doesn't exist
update-alternatives: warning: skip creation of /usr/share/man/man1/lzegrep.1.gz because associated file /usr/share/man/man1/xzegrep.1.gz (of link group lzma) doesn't exist
update-alternatives: warning: skip creation of /usr/share/man/man1/lzfgrep.1.gz because associated file /usr/share/man/man1/xzfgrep.1.gz (of link group lzma) doesn't exist
Setting up libquadmath0:amd64 (10.2.1-6) ...
Setting up libpng16-16:amd64 (1.6.37-3) ...
Setting up libmpc3:amd64 (1.2.0-1) ...
Setting up libatomic1:amd64 (10.2.1-6) ...
Setting up patch (2.7.6-7) ...
Setting up libwebp6:amd64 (0.6.1-2.1) ...
Setting up fonts-dejavu-core (2.37-2) ...
Setting up libsasl2-2:amd64 (2.1.27+dfsg-2.1) ...
Setting up libubsan1:amd64 (10.2.1-6) ...
Setting up libmd0:amd64 (1.0.3-3) ...
Setting up libnsl-dev:amd64 (1.3.0-2) ...
Setting up sensible-utils (0.0.14) ...
Setting up libcrypt-dev:amd64 (1:4.4.18-4) ...
Setting up libmpdec3:amd64 (2.5.1-1) ...
Setting up netbase (6.3) ...
Setting up python-pip-whl (20.3.4-4) ...
Setting up libtiff5:amd64 (4.2.0-1) ...
Setting up libjs-jquery (3.5.1+dfsg+~3.5.5-7) ...
Setting up libbinutils:amd64 (2.35.2-2) ...
Setting up libisl23:amd64 (0.23-1) ...
Setting up libc-dev-bin (2.31-13) ...
Setting up libbsd0:amd64 (0.11.3-1) ...
Setting up readline-common (8.1-1) ...
Setting up libcc1-0:amd64 (10.2.1-6) ...
Setting up liblocale-gettext-perl (1.07-4+b1) ...
Setting up liblsan0:amd64 (10.2.1-6) ...
Setting up cpp-10 (10.2.1-6) ...
Setting up libitm1:amd64 (10.2.1-6) ...
Setting up libgdbm6:amd64 (1.19-2) ...
Setting up libjs-underscore (1.9.1~dfsg-3) ...
Setting up libtsan0:amd64 (10.2.1-6) ...
Setting up libctf0:amd64 (2.35.2-2) ...
Setting up pinentry-curses (1.1.0-4) ...
Setting up manpages-dev (5.10-1) ...
Setting up libxdmcp6:amd64 (1:1.1.2-3) ...
Setting up libxcb1:amd64 (1.14-3) ...
Setting up libgcc-10-dev:amd64 (10.2.1-6) ...
Setting up libreadline8:amd64 (8.1-1) ...
Setting up libldap-2.4-2:amd64 (2.4.57+dfsg-3) ...
Setting up libfreetype6:amd64 (2.10.4+dfsg-1) ...
Setting up libgdbm-compat4:amd64 (1.19-2) ...
Setting up ucf (3.0043) ...
debconf: unable to initialize frontend: Dialog
debconf: (TERM is not set, so the dialog frontend is not usable.)
debconf: falling back to frontend: Readline
Setting up libperl5.32:amd64 (5.32.1-4+deb11u1) ...
Setting up libjs-sphinxdoc (3.4.3-2) ...
Setting up cpp (4:10.2.1-1) ...
Setting up gpgconf (2.2.27-2) ...
Setting up libc6-dev:amd64 (2.31-13) ...
Setting up libx11-6:amd64 (2:1.7.2-1) ...
Setting up gpg (2.2.27-2) ...
Setting up libpython3.9-stdlib:amd64 (3.9.2-1) ...
Setting up libpython3-stdlib:amd64 (3.9.2-3) ...
Setting up gnupg-utils (2.2.27-2) ...
Setting up binutils-x86-64-linux-gnu (2.35.2-2) ...
Setting up libstdc++-10-dev:amd64 (10.2.1-6) ...
Setting up gpg-agent (2.2.27-2) ...
Setting up libxpm4:amd64 (1:3.5.12-1) ...
Setting up fontconfig-config (2.13.1-4.2) ...
debconf: unable to initialize frontend: Dialog
debconf: (TERM is not set, so the dialog frontend is not usable.)
debconf: falling back to frontend: Readline
Setting up gpgsm (2.2.27-2) ...
Setting up binutils (2.35.2-2) ...
Setting up dirmngr (2.2.27-2) ...
Setting up perl (5.32.1-4+deb11u1) ...
Setting up libpython3.9:amd64 (3.9.2-1) ...
Setting up libexpat1-dev:amd64 (2.2.10-2) ...
Setting up gcc-10 (10.2.1-6) ...
Setting up libdpkg-perl (1.20.9) ...
Setting up gpg-wks-server (2.2.27-2) ...
Setting up zlib1g-dev:amd64 (1:1.2.11.dfsg-2) ...
Setting up libfontconfig1:amd64 (2.13.1-4.2) ...
Setting up python3.9 (3.9.2-1) ...
Setting up g++-10 (10.2.1-6) ...
Setting up gpg-wks-client (2.2.27-2) ...
Setting up libfile-fcntllock-perl (0.22-3+b7) ...
Setting up libalgorithm-diff-perl (1.201-1) ...
Setting up libpython3.9-dev:amd64 (3.9.2-1) ...
Setting up python3 (3.9.2-3) ...
running python rtupdate hooks for python3.9...
running python post-rtupdate hooks for python3.9...
Setting up python3-wheel (0.34.2-1) ...
Setting up gcc (4:10.2.1-1) ...
Setting up dpkg-dev (1.20.9) ...
Setting up libgd3:amd64 (2.3.0-2) ...
Setting up g++ (4:10.2.1-1) ...
update-alternatives: using /usr/bin/g++ to provide /usr/bin/c++ (c++) in auto mode
Setting up python3.9-dev (3.9.2-1) ...
Setting up gnupg (2.2.27-2) ...
Setting up build-essential (12.9) ...
Setting up python3-lib2to3 (3.9.2-1) ...
Setting up libalgorithm-diff-xs-perl (0.04-6+b1) ...
Setting up libc-devtools (2.31-13) ...
Setting up libalgorithm-merge-perl (0.08-3) ...
Setting up python3-pkg-resources (52.0.0-4) ...
Setting up python3-distutils (3.9.2-1) ...
Setting up libpython3-dev:amd64 (3.9.2-3) ...
Setting up python3-setuptools (52.0.0-4) ...
Setting up python3-dev (3.9.2-3) ...
Setting up python3-pip (20.3.4-4) ...
Processing triggers for libc-bin (2.31-13) ...
Requirement already satisfied: pip in /usr/lib/python3/dist-packages (20.3.4)
Collecting pip
  Downloading pip-21.2.4-py3-none-any.whl (1.6 MB)
Requirement already satisfied: setuptools in /usr/lib/python3/dist-packages (52.0.0)
Collecting setuptools
  Downloading setuptools-58.0.4-py3-none-any.whl (816 kB)
Installing collected packages: setuptools, pip
  Attempting uninstall: setuptools
    Found existing installation: setuptools 52.0.0
    Not uninstalling setuptools at /usr/lib/python3/dist-packages, outside environment /usr
    Can't uninstall 'setuptools'. No files were found to uninstall.
  Attempting uninstall: pip
    Found existing installation: pip 20.3.4
    Not uninstalling pip at /usr/lib/python3/dist-packages, outside environment /usr
    Can't uninstall 'pip'. No files were found to uninstall.
Successfully installed pip-21.2.4 setuptools-58.0.4
Removing intermediate container 8087a8236f68
 ---> 5d608a2ff7a2
Step 7/12 : COPY python/pyspark ${SPARK_HOME}/python/pyspark
 ---> cd296c07eaee
Step 8/12 : COPY python/lib ${SPARK_HOME}/python/lib
 ---> 7db0f9da11b0
Step 9/12 : WORKDIR /opt/spark/work-dir
 ---> Running in 5935bfdfe155
Removing intermediate container 5935bfdfe155
 ---> 3941db7947c7
Step 10/12 : ENTRYPOINT [ "/opt/entrypoint.sh" ]
 ---> Running in 9bfb0367a664
Removing intermediate container 9bfb0367a664
 ---> ff26b7aa1c05
Step 11/12 : ARG spark_uid=185
 ---> Running in ef4757b48b7c
Removing intermediate container ef4757b48b7c
 ---> 59e990b6a1fd
Step 12/12 : USER ${spark_uid}
 ---> Running in 48fb93ccfc73
Removing intermediate container 48fb93ccfc73
 ---> 9f4857c93488
[Warning] One or more build-args [java_image_tag] were not consumed
Successfully built 9f4857c93488
Successfully tagged kubespark/spark-py:3.3.0-SNAPSHOT_999240c1-7b37-46ab-b0af-b9a4be5a22d2
Sending build context to Docker daemon  314.6MB

Step 1/12 : ARG base_img
Step 2/12 : FROM $base_img
 ---> 7d5d3c295b09
Step 3/12 : WORKDIR /
 ---> Using cache
 ---> 181449539c4c
Step 4/12 : USER 0
 ---> Using cache
 ---> 68107827c8b8
Step 5/12 : RUN mkdir ${SPARK_HOME}/R
 ---> Running in 20e1ae7fd84d
Removing intermediate container 20e1ae7fd84d
 ---> a3a44387f3d3
Step 6/12 : RUN   apt-get update &&   apt install -y gnupg &&   echo "deb http://cloud.r-project.org/bin/linux/debian buster-cran35/" >> /etc/apt/sources.list &&   apt-key adv --keyserver keyserver.ubuntu.com --recv-key 'E19F5F87128899B192B1A2C2AD5F960A256A04AF' &&   apt-get update &&   apt install -y -t buster-cran35 r-base r-base-dev &&   rm -rf /var/cache/apt/*
 ---> Running in e3160d97ab55
Hit:1 http://security.debian.org/debian-security bullseye-security InRelease
Hit:2 https://deb.debian.org/debian bullseye InRelease
Hit:3 https://deb.debian.org/debian bullseye-updates InRelease
Reading package lists...

WARNING: apt does not have a stable CLI interface. Use with caution in scripts.

Reading package lists...
Building dependency tree...
Reading state information...
The following additional packages will be installed:
  dirmngr gnupg-l10n gnupg-utils gpg gpg-agent gpg-wks-client gpg-wks-server
  gpgconf gpgsm libassuan0 libksba8 libldap-2.4-2 libldap-common libnpth0
  libreadline8 libsasl2-2 libsasl2-modules libsasl2-modules-db pinentry-curses
  readline-common
Suggested packages:
  dbus-user-session libpam-systemd pinentry-gnome3 tor parcimonie xloadimage
  scdaemon libsasl2-modules-gssapi-mit | libsasl2-modules-gssapi-heimdal
  libsasl2-modules-ldap libsasl2-modules-otp libsasl2-modules-sql pinentry-doc
  readline-doc
The following NEW packages will be installed:
  dirmngr gnupg gnupg-l10n gnupg-utils gpg gpg-agent gpg-wks-client
  gpg-wks-server gpgconf gpgsm libassuan0 libksba8 libldap-2.4-2
  libldap-common libnpth0 libreadline8 libsasl2-2 libsasl2-modules
  libsasl2-modules-db pinentry-curses readline-common
0 upgraded, 21 newly installed, 0 to remove and 0 not upgraded.
Need to get 8510 kB of archives.
After this operation, 17.5 MB of additional disk space will be used.
Get:1 https://deb.debian.org/debian bullseye/main amd64 readline-common all 8.1-1 [73.7 kB]
Get:2 https://deb.debian.org/debian bullseye/main amd64 libreadline8 amd64 8.1-1 [169 kB]
Get:3 https://deb.debian.org/debian bullseye/main amd64 libassuan0 amd64 2.5.3-7.1 [50.5 kB]
Get:4 https://deb.debian.org/debian bullseye/main amd64 gpgconf amd64 2.2.27-2 [547 kB]
Get:5 https://deb.debian.org/debian bullseye/main amd64 libksba8 amd64 1.5.0-3 [123 kB]
Get:6 https://deb.debian.org/debian bullseye/main amd64 libsasl2-modules-db amd64 2.1.27+dfsg-2.1 [69.1 kB]
Get:7 https://deb.debian.org/debian bullseye/main amd64 libsasl2-2 amd64 2.1.27+dfsg-2.1 [106 kB]
Get:8 https://deb.debian.org/debian bullseye/main amd64 libldap-2.4-2 amd64 2.4.57+dfsg-3 [232 kB]
Get:9 https://deb.debian.org/debian bullseye/main amd64 libnpth0 amd64 1.6-3 [19.0 kB]
Get:10 https://deb.debian.org/debian bullseye/main amd64 dirmngr amd64 2.2.27-2 [762 kB]
Get:11 https://deb.debian.org/debian bullseye/main amd64 gnupg-l10n all 2.2.27-2 [1084 kB]
Get:12 https://deb.debian.org/debian bullseye/main amd64 gnupg-utils amd64 2.2.27-2 [905 kB]
Get:13 https://deb.debian.org/debian bullseye/main amd64 gpg amd64 2.2.27-2 [927 kB]
Get:14 https://deb.debian.org/debian bullseye/main amd64 pinentry-curses amd64 1.1.0-4 [64.9 kB]
Get:15 https://deb.debian.org/debian bullseye/main amd64 gpg-agent amd64 2.2.27-2 [669 kB]
Get:16 https://deb.debian.org/debian bullseye/main amd64 gpg-wks-client amd64 2.2.27-2 [523 kB]
Get:17 https://deb.debian.org/debian bullseye/main amd64 gpg-wks-server amd64 2.2.27-2 [516 kB]
Get:18 https://deb.debian.org/debian bullseye/main amd64 gpgsm amd64 2.2.27-2 [645 kB]
Get:19 https://deb.debian.org/debian bullseye/main amd64 gnupg all 2.2.27-2 [825 kB]
Get:20 https://deb.debian.org/debian bullseye/main amd64 libldap-common all 2.4.57+dfsg-3 [95.9 kB]
Get:21 https://deb.debian.org/debian bullseye/main amd64 libsasl2-modules amd64 2.1.27+dfsg-2.1 [104 kB]
debconf: delaying package configuration, since apt-utils is not installed
Fetched 8510 kB in 2s (4427 kB/s)
Selecting previously unselected package readline-common.
(Reading database ... 
(Reading database ... 5%
(Reading database ... 10%
(Reading database ... 15%
(Reading database ... 20%
(Reading database ... 25%
(Reading database ... 30%
(Reading database ... 35%
(Reading database ... 40%
(Reading database ... 45%
(Reading database ... 50%
(Reading database ... 55%
(Reading database ... 60%
(Reading database ... 65%
(Reading database ... 70%
(Reading database ... 75%
(Reading database ... 80%
(Reading database ... 85%
(Reading database ... 90%
(Reading database ... 95%
(Reading database ... 100%
(Reading database ... 7485 files and directories currently installed.)
Preparing to unpack .../00-readline-common_8.1-1_all.deb ...
Unpacking readline-common (8.1-1) ...
Selecting previously unselected package libreadline8:amd64.
Preparing to unpack .../01-libreadline8_8.1-1_amd64.deb ...
Unpacking libreadline8:amd64 (8.1-1) ...
Selecting previously unselected package libassuan0:amd64.
Preparing to unpack .../02-libassuan0_2.5.3-7.1_amd64.deb ...
Unpacking libassuan0:amd64 (2.5.3-7.1) ...
Selecting previously unselected package gpgconf.
Preparing to unpack .../03-gpgconf_2.2.27-2_amd64.deb ...
Unpacking gpgconf (2.2.27-2) ...
Selecting previously unselected package libksba8:amd64.
Preparing to unpack .../04-libksba8_1.5.0-3_amd64.deb ...
Unpacking libksba8:amd64 (1.5.0-3) ...
Selecting previously unselected package libsasl2-modules-db:amd64.
Preparing to unpack .../05-libsasl2-modules-db_2.1.27+dfsg-2.1_amd64.deb ...
Unpacking libsasl2-modules-db:amd64 (2.1.27+dfsg-2.1) ...
Selecting previously unselected package libsasl2-2:amd64.
Preparing to unpack .../06-libsasl2-2_2.1.27+dfsg-2.1_amd64.deb ...
Unpacking libsasl2-2:amd64 (2.1.27+dfsg-2.1) ...
Selecting previously unselected package libldap-2.4-2:amd64.
Preparing to unpack .../07-libldap-2.4-2_2.4.57+dfsg-3_amd64.deb ...
Unpacking libldap-2.4-2:amd64 (2.4.57+dfsg-3) ...
Selecting previously unselected package libnpth0:amd64.
Preparing to unpack .../08-libnpth0_1.6-3_amd64.deb ...
Unpacking libnpth0:amd64 (1.6-3) ...
Selecting previously unselected package dirmngr.
Preparing to unpack .../09-dirmngr_2.2.27-2_amd64.deb ...
Unpacking dirmngr (2.2.27-2) ...
Selecting previously unselected package gnupg-l10n.
Preparing to unpack .../10-gnupg-l10n_2.2.27-2_all.deb ...
Unpacking gnupg-l10n (2.2.27-2) ...
Selecting previously unselected package gnupg-utils.
Preparing to unpack .../11-gnupg-utils_2.2.27-2_amd64.deb ...
Unpacking gnupg-utils (2.2.27-2) ...
Selecting previously unselected package gpg.
Preparing to unpack .../12-gpg_2.2.27-2_amd64.deb ...
Unpacking gpg (2.2.27-2) ...
Selecting previously unselected package pinentry-curses.
Preparing to unpack .../13-pinentry-curses_1.1.0-4_amd64.deb ...
Unpacking pinentry-curses (1.1.0-4) ...
Selecting previously unselected package gpg-agent.
Preparing to unpack .../14-gpg-agent_2.2.27-2_amd64.deb ...
Unpacking gpg-agent (2.2.27-2) ...
Selecting previously unselected package gpg-wks-client.
Preparing to unpack .../15-gpg-wks-client_2.2.27-2_amd64.deb ...
Unpacking gpg-wks-client (2.2.27-2) ...
Selecting previously unselected package gpg-wks-server.
Preparing to unpack .../16-gpg-wks-server_2.2.27-2_amd64.deb ...
Unpacking gpg-wks-server (2.2.27-2) ...
Selecting previously unselected package gpgsm.
Preparing to unpack .../17-gpgsm_2.2.27-2_amd64.deb ...
Unpacking gpgsm (2.2.27-2) ...
Selecting previously unselected package gnupg.
Preparing to unpack .../18-gnupg_2.2.27-2_all.deb ...
Unpacking gnupg (2.2.27-2) ...
Selecting previously unselected package libldap-common.
Preparing to unpack .../19-libldap-common_2.4.57+dfsg-3_all.deb ...
Unpacking libldap-common (2.4.57+dfsg-3) ...
Selecting previously unselected package libsasl2-modules:amd64.
Preparing to unpack .../20-libsasl2-modules_2.1.27+dfsg-2.1_amd64.deb ...
Unpacking libsasl2-modules:amd64 (2.1.27+dfsg-2.1) ...
Setting up libksba8:amd64 (1.5.0-3) ...
Setting up libsasl2-modules:amd64 (2.1.27+dfsg-2.1) ...
Setting up libnpth0:amd64 (1.6-3) ...
Setting up libassuan0:amd64 (2.5.3-7.1) ...
Setting up libldap-common (2.4.57+dfsg-3) ...
Setting up libsasl2-modules-db:amd64 (2.1.27+dfsg-2.1) ...
Setting up gnupg-l10n (2.2.27-2) ...
Setting up libsasl2-2:amd64 (2.1.27+dfsg-2.1) ...
Setting up readline-common (8.1-1) ...
Setting up pinentry-curses (1.1.0-4) ...
Setting up libreadline8:amd64 (8.1-1) ...
Setting up libldap-2.4-2:amd64 (2.4.57+dfsg-3) ...
Setting up gpgconf (2.2.27-2) ...
Setting up gpg (2.2.27-2) ...
Setting up gnupg-utils (2.2.27-2) ...
Setting up gpg-agent (2.2.27-2) ...
Setting up gpgsm (2.2.27-2) ...
Setting up dirmngr (2.2.27-2) ...
Setting up gpg-wks-server (2.2.27-2) ...
Setting up gpg-wks-client (2.2.27-2) ...
Setting up gnupg (2.2.27-2) ...
Processing triggers for libc-bin (2.31-13) ...
Warning: apt-key is deprecated. Manage keyring files in trusted.gpg.d instead (see apt-key(8)).
Executing: /tmp/apt-key-gpghome.wtEF2OHgCB/gpg.1.sh --keyserver keyserver.ubuntu.com --recv-key E19F5F87128899B192B1A2C2AD5F960A256A04AF
gpg: key AD5F960A256A04AF: public key "Johannes Ranke (Wissenschaftlicher Berater) <johannes.ranke@jrwb.de>" imported
gpg: Total number processed: 1
gpg:               imported: 1
Hit:1 http://security.debian.org/debian-security bullseye-security InRelease
Get:2 http://cloud.r-project.org/bin/linux/debian buster-cran35/ InRelease [4375 B]
Hit:3 https://deb.debian.org/debian bullseye InRelease
Hit:4 https://deb.debian.org/debian bullseye-updates InRelease
Get:5 http://cloud.r-project.org/bin/linux/debian buster-cran35/ Packages [53.3 kB]
Fetched 57.6 kB in 2s (32.9 kB/s)
Reading package lists...

WARNING: apt does not have a stable CLI interface. Use with caution in scripts.

Reading package lists...
Building dependency tree...
Reading state information...
Some packages could not be installed. This may mean that you have
requested an impossible situation or if you are using the unstable
distribution that some required packages have not yet been created
or been moved out of Incoming.
The following information may help to resolve the situation:

The following packages have unmet dependencies:
 r-base-core : Depends: libicu63 (>= 63.1-1~) but it is not installable
               Depends: libreadline7 (>= 6.0) but it is not installable
E: Unable to correct problems, you have held broken packages.
The command '/bin/sh -c apt-get update &&   apt install -y gnupg &&   echo "deb http://cloud.r-project.org/bin/linux/debian buster-cran35/" >> /etc/apt/sources.list &&   apt-key adv --keyserver keyserver.ubuntu.com --recv-key 'E19F5F87128899B192B1A2C2AD5F960A256A04AF' &&   apt-get update &&   apt install -y -t buster-cran35 r-base r-base-dev &&   rm -rf /var/cache/apt/*' returned a non-zero code: 100
Failed to build SparkR Docker image, please refer to Docker build output for details.
[ERROR] Command execution failed.
org.apache.commons.exec.ExecuteException: Process exited with an error: 1 (Exit value: 1)
    at org.apache.commons.exec.DefaultExecutor.executeInternal (DefaultExecutor.java:404)
    at org.apache.commons.exec.DefaultExecutor.execute (DefaultExecutor.java:166)
    at org.codehaus.mojo.exec.ExecMojo.executeCommandLine (ExecMojo.java:804)
    at org.codehaus.mojo.exec.ExecMojo.executeCommandLine (ExecMojo.java:751)
    at org.codehaus.mojo.exec.ExecMojo.execute (ExecMojo.java:313)
    at org.apache.maven.plugin.DefaultBuildPluginManager.executeMojo (DefaultBuildPluginManager.java:137)
    at org.apache.maven.lifecycle.internal.MojoExecutor.execute (MojoExecutor.java:210)
    at org.apache.maven.lifecycle.internal.MojoExecutor.execute (MojoExecutor.java:156)
    at org.apache.maven.lifecycle.internal.MojoExecutor.execute (MojoExecutor.java:148)
    at org.apache.maven.lifecycle.internal.LifecycleModuleBuilder.buildProject (LifecycleModuleBuilder.java:117)
    at org.apache.maven.lifecycle.internal.LifecycleModuleBuilder.buildProject (LifecycleModuleBuilder.java:81)
    at org.apache.maven.lifecycle.internal.builder.singlethreaded.SingleThreadedBuilder.build (SingleThreadedBuilder.java:56)
    at org.apache.maven.lifecycle.internal.LifecycleStarter.execute (LifecycleStarter.java:128)
    at org.apache.maven.DefaultMaven.doExecute (DefaultMaven.java:305)
    at org.apache.maven.DefaultMaven.doExecute (DefaultMaven.java:192)
    at org.apache.maven.DefaultMaven.execute (DefaultMaven.java:105)
    at org.apache.maven.cli.MavenCli.execute (MavenCli.java:957)
    at org.apache.maven.cli.MavenCli.doMain (MavenCli.java:289)
    at org.apache.maven.cli.MavenCli.main (MavenCli.java:193)
    at sun.reflect.NativeMethodAccessorImpl.invoke0 (Native Method)
    at sun.reflect.NativeMethodAccessorImpl.invoke (NativeMethodAccessorImpl.java:62)
    at sun.reflect.DelegatingMethodAccessorImpl.invoke (DelegatingMethodAccessorImpl.java:43)
    at java.lang.reflect.Method.invoke (Method.java:498)
    at org.codehaus.plexus.classworlds.launcher.Launcher.launchEnhanced (Launcher.java:282)
    at org.codehaus.plexus.classworlds.launcher.Launcher.launch (Launcher.java:225)
    at org.codehaus.plexus.classworlds.launcher.Launcher.mainWithExitCode (Launcher.java:406)
    at org.codehaus.plexus.classworlds.launcher.Launcher.main (Launcher.java:347)
[INFO] ------------------------------------------------------------------------
[INFO] Reactor Summary for Spark Project Parent POM 3.3.0-SNAPSHOT:
[INFO] 
[INFO] Spark Project Parent POM ........................... SUCCESS [  5.084 s]
[INFO] Spark Project Tags ................................. SUCCESS [ 11.397 s]
[INFO] Spark Project Local DB ............................. SUCCESS [  8.163 s]
[INFO] Spark Project Networking ........................... SUCCESS [ 12.899 s]
[INFO] Spark Project Shuffle Streaming Service ............ SUCCESS [  9.820 s]
[INFO] Spark Project Unsafe ............................... SUCCESS [ 14.399 s]
[INFO] Spark Project Launcher ............................. SUCCESS [  6.645 s]
[INFO] Spark Project Core ................................. SUCCESS [03:23 min]
[INFO] Spark Project Kubernetes Integration Tests ......... FAILURE [01:50 min]
[INFO] ------------------------------------------------------------------------
[INFO] BUILD FAILURE
[INFO] ------------------------------------------------------------------------
[INFO] Total time:  06:24 min
[INFO] Finished at: 2021-09-15T20:58:24-07:00
[INFO] ------------------------------------------------------------------------
[ERROR] Failed to execute goal org.codehaus.mojo:exec-maven-plugin:1.6.0:exec (setup-integration-test-env) on project spark-kubernetes-integration-tests_2.12: Command execution failed.: Process exited with an error: 1 (Exit value: 1) -> [Help 1]
[ERROR] 
[ERROR] To see the full stack trace of the errors, re-run Maven with the -e switch.
[ERROR] Re-run Maven using the -X switch to enable full debug logging.
[ERROR] 
[ERROR] For more information about the errors and possible solutions, please read the following articles:
[ERROR] [Help 1] http://cwiki.apache.org/confluence/display/MAVEN/MojoExecutionException
[ERROR] 
[ERROR] After correcting the problems, you can resume the build with the command
[ERROR]   mvn <args> -rf :spark-kubernetes-integration-tests_2.12
+ retcode3=1
+ kill -9 4004290
+ minikube stop
* Stopping node "minikube"  ...
* Powering off "minikube" via SSH ...
* 1 nodes stopped.
/tmp/jenkins8873148448230823583.sh: line 68: 4004290 Killed                  minikube mount ${PVC_TESTS_HOST_PATH}:${PVC_TESTS_VM_PATH} --9p-version=9p2000.L
+ rm -rf /tmp/tmp.SrMy6jg0a5
+ exit 1
Build step 'Execute shell' marked build as failure
Archiving artifacts
Finished: FAILURE